﻿2026-07-30T11:53:06.0357963Z Current runner version: '2.336.0'
2026-07-30T11:53:06.0362667Z Runner name: 'hfenduleam'
2026-07-30T11:53:06.0363098Z Runner group name: 'Default'
2026-07-30T11:53:06.0363634Z Machine name: 'HFENDULEAM'
2026-07-30T11:53:06.0366828Z ##[group]GITHUB_TOKEN Permissions
2026-07-30T11:53:06.0368273Z Actions: write
2026-07-30T11:53:06.0368695Z ArtifactMetadata: write
2026-07-30T11:53:06.0369045Z Attestations: write
2026-07-30T11:53:06.0369365Z Checks: write
2026-07-30T11:53:06.0369680Z CodeQuality: write
2026-07-30T11:53:06.0369990Z Contents: write
2026-07-30T11:53:06.0370301Z CopilotRequests: write
2026-07-30T11:53:06.0370697Z Deployments: write
2026-07-30T11:53:06.0370999Z Discussions: write
2026-07-30T11:53:06.0371330Z Drives: write
2026-07-30T11:53:06.0371622Z Issues: write
2026-07-30T11:53:06.0371913Z Metadata: read
2026-07-30T11:53:06.0372273Z Models: read
2026-07-30T11:53:06.0372587Z Packages: write
2026-07-30T11:53:06.0373026Z Pages: write
2026-07-30T11:53:06.0373519Z PullRequests: write
2026-07-30T11:53:06.0373904Z RepositoryProjects: write
2026-07-30T11:53:06.0374246Z SecurityEvents: write
2026-07-30T11:53:06.0374584Z Statuses: write
2026-07-30T11:53:06.0374890Z VulnerabilityAlerts: read
2026-07-30T11:53:06.0375225Z ##[endgroup]
2026-07-30T11:53:06.0376606Z Secret source: Actions
2026-07-30T11:53:06.0377204Z Prepare workflow directory
2026-07-30T11:53:06.0663199Z Prepare all required actions
2026-07-30T11:53:06.0694387Z Getting action download info
2026-07-30T11:53:06.4592391Z Download action repository 'actions/checkout@v5' (SHA:fbc6f3992d24b796d5a048ff273f7fcc4a7b6c09)
2026-07-30T11:53:07.1485877Z Complete job name: unit (self-hosted, Windows, hfenduleam)
2026-07-30T11:53:07.3384052Z ##[group]Run $floorBytes = 32GB
2026-07-30T11:53:07.3384617Z [36;1m$floorBytes = 32GB[0m
2026-07-30T11:53:07.3385056Z [36;1m$drive = (Get-Item $env:GITHUB_WORKSPACE).PSDrive[0m
2026-07-30T11:53:07.3385542Z [36;1m$freeBytes = [int64]$drive.Free[0m
2026-07-30T11:53:07.3386168Z [36;1mWrite-Host "disk preflight: drive=$($drive.Root) free_bytes=$freeBytes floor_bytes=$floorBytes"[0m
2026-07-30T11:53:07.3386895Z [36;1mif ($freeBytes -lt $floorBytes) {[0m
2026-07-30T11:53:07.3387516Z [36;1m  Write-Error "RESOURCE=disk drive=$($drive.Root) free_bytes=$freeBytes floor_bytes=$floorBytes"[0m
2026-07-30T11:53:07.3388110Z [36;1m  exit 1[0m
2026-07-30T11:53:07.3388426Z [36;1m}[0m
2026-07-30T11:53:07.3396329Z shell: C:\Program Files\PowerShell\7\pwsh.EXE -command ". '{0}'"
2026-07-30T11:53:07.3397004Z ##[endgroup]
2026-07-30T11:53:07.7010994Z disk preflight: drive=C:\ free_bytes=151281168384 floor_bytes=34359738368
2026-07-30T11:53:07.9982470Z ##[group]Run actions/checkout@v5
2026-07-30T11:53:07.9983359Z with:
2026-07-30T11:53:07.9983986Z   repository: BigscreenVR/spt-bs-core
2026-07-30T11:53:07.9989533Z   token: ***
2026-07-30T11:53:07.9990160Z   ssh-strict: true
2026-07-30T11:53:07.9990772Z   ssh-user: git
2026-07-30T11:53:07.9991399Z   persist-credentials: true
2026-07-30T11:53:07.9992117Z   clean: true
2026-07-30T11:53:07.9992744Z   sparse-checkout-cone-mode: true
2026-07-30T11:53:07.9993479Z   fetch-depth: 1
2026-07-30T11:53:07.9994093Z   fetch-tags: false
2026-07-30T11:53:07.9994767Z   show-progress: true
2026-07-30T11:53:07.9995418Z   lfs: false
2026-07-30T11:53:07.9996018Z   submodules: false
2026-07-30T11:53:07.9996657Z   set-safe-directory: true
2026-07-30T11:53:07.9997369Z   allow-unsafe-pr-checkout: false
2026-07-30T11:53:07.9998070Z ##[endgroup]
2026-07-30T11:53:08.4519897Z Syncing repository: BigscreenVR/spt-bs-core
2026-07-30T11:53:08.4522196Z ##[group]Getting Git version info
2026-07-30T11:53:08.4523389Z Working directory is 'C:\actions-runner\_work\spt-bs-core\spt-bs-core'
2026-07-30T11:53:08.4836434Z [command]"C:\Program Files\Git\cmd\git.exe" version
2026-07-30T11:53:08.5143680Z git version 2.43.0.windows.1
2026-07-30T11:53:08.5181872Z ##[endgroup]
2026-07-30T11:53:08.5191961Z Copying 'C:\Users\decid\.gitconfig' to 'C:\actions-runner\_work\_temp\c080cb25-4085-4cb8-9613-6f1b8373db18\.gitconfig'
2026-07-30T11:53:08.5211845Z Temporarily overriding HOME='C:\actions-runner\_work\_temp\c080cb25-4085-4cb8-9613-6f1b8373db18' before making global git config changes
2026-07-30T11:53:08.5214782Z Adding repository directory to the temporary git global config as a safe directory
2026-07-30T11:53:08.5218686Z [command]"C:\Program Files\Git\cmd\git.exe" config --global --add safe.directory C:\actions-runner\_work\spt-bs-core\spt-bs-core
2026-07-30T11:53:08.6815785Z [command]"C:\Program Files\Git\cmd\git.exe" config --local --get remote.origin.url
2026-07-30T11:53:08.7110957Z https://github.com/BigscreenVR/spt-bs-core
2026-07-30T11:53:08.7143702Z ##[group]Removing previously created refs, to avoid conflicts
2026-07-30T11:53:08.7158046Z [command]"C:\Program Files\Git\cmd\git.exe" rev-parse --symbolic-full-name --verify --quiet HEAD
2026-07-30T11:53:08.7464529Z refs/heads/golden/ci-traceable-pin
2026-07-30T11:53:08.7495529Z [command]"C:\Program Files\Git\cmd\git.exe" checkout --detach
2026-07-30T11:53:08.7942516Z HEAD is now at d26a2b25 ci: pin traceable-reqs to 0.2.0, matching the runner
2026-07-30T11:53:09.0864465Z ##[endgroup]
2026-07-30T11:53:09.0870921Z [command]"C:\Program Files\Git\cmd\git.exe" submodule status
2026-07-30T11:53:11.3885223Z ##[group]Cleaning the repository
2026-07-30T11:53:11.3890266Z [command]"C:\Program Files\Git\cmd\git.exe" clean -ffdx
2026-07-30T11:53:15.7730707Z Removing .adapter-notify/
2026-07-30T11:53:15.7731113Z Removing target/
2026-07-30T11:53:15.7760079Z [command]"C:\Program Files\Git\cmd\git.exe" reset --hard HEAD
2026-07-30T11:53:15.8331710Z HEAD is now at d26a2b25 ci: pin traceable-reqs to 0.2.0, matching the runner
2026-07-30T11:53:15.8354347Z ##[endgroup]
2026-07-30T11:53:15.8359194Z ##[group]Disabling automatic garbage collection
2026-07-30T11:53:15.8363643Z [command]"C:\Program Files\Git\cmd\git.exe" config --local gc.auto 0
2026-07-30T11:53:15.9744919Z ##[endgroup]
2026-07-30T11:53:15.9745428Z ##[group]Setting up auth
2026-07-30T11:53:15.9752277Z [command]"C:\Program Files\Git\cmd\git.exe" config --local --name-only --get-regexp core\.sshCommand
2026-07-30T11:53:16.0007408Z [command]"C:\Program Files\Git\cmd\git.exe" submodule foreach --recursive "sh -c \"git config --local --name-only --get-regexp 'core\.sshCommand' && git config --local --unset-all 'core.sshCommand' || :\""
2026-07-30T11:53:16.5872348Z [command]"C:\Program Files\Git\cmd\git.exe" config --local --name-only --get-regexp http\.https\:\/\/github\.com\/\.extraheader
2026-07-30T11:53:16.6155923Z [command]"C:\Program Files\Git\cmd\git.exe" submodule foreach --recursive "sh -c \"git config --local --name-only --get-regexp 'http\.https\:\/\/github\.com\/\.extraheader' && git config --local --unset-all 'http.https://github.com/.extraheader' || :\""
2026-07-30T11:53:17.4637034Z [command]"C:\Program Files\Git\cmd\git.exe" config --local --name-only --get-regexp ^includeIf\.gitdir:
2026-07-30T11:53:17.4911544Z [command]"C:\Program Files\Git\cmd\git.exe" submodule foreach --recursive "git config --local --show-origin --name-only --get-regexp remote.origin.url"
2026-07-30T11:53:18.0571346Z [command]"C:\Program Files\Git\cmd\git.exe" config --local http.https://github.com/.extraheader "AUTHORIZATION: basic ***"
2026-07-30T11:53:18.0910897Z ##[endgroup]
2026-07-30T11:53:18.0911528Z ##[group]Fetching the repository
2026-07-30T11:53:18.0918832Z [command]"C:\Program Files\Git\cmd\git.exe" -c protocol.version=2 fetch --no-tags --prune --no-recurse-submodules --depth=1 origin +d26a2b2551891a15770802275ea1ff194c183951:refs/remotes/origin/main
2026-07-30T11:53:18.9403797Z From https://github.com/BigscreenVR/spt-bs-core
2026-07-30T11:53:18.9404218Z  + 8f3e10bc...d26a2b25 d26a2b2551891a15770802275ea1ff194c183951 -> origin/main  (forced update)
2026-07-30T11:53:18.9546338Z ##[endgroup]
2026-07-30T11:53:18.9546807Z ##[group]Determining the checkout info
2026-07-30T11:53:18.9547307Z ##[endgroup]
2026-07-30T11:53:18.9552744Z [command]"C:\Program Files\Git\cmd\git.exe" sparse-checkout disable
2026-07-30T11:53:18.9852022Z [command]"C:\Program Files\Git\cmd\git.exe" config --local --unset-all extensions.worktreeConfig
2026-07-30T11:53:19.0103828Z ##[group]Checking out the ref
2026-07-30T11:53:19.0108683Z [command]"C:\Program Files\Git\cmd\git.exe" checkout --progress --force -B main refs/remotes/origin/main
2026-07-30T11:53:19.0622811Z branch 'main' set up to track 'origin/main'.
2026-07-30T11:53:19.0623085Z Your branch is up to date with 'origin/main'.
2026-07-30T11:53:19.0623344Z Switched to and reset branch 'main'
2026-07-30T11:53:19.0643799Z ##[endgroup]
2026-07-30T11:53:19.0922472Z [command]"C:\Program Files\Git\cmd\git.exe" log -1 --format=%H
2026-07-30T11:53:19.1165525Z d26a2b2551891a15770802275ea1ff194c183951
2026-07-30T11:53:19.2710017Z ##[group]Run cargo build -p spt --bin translate_proof_fixture
2026-07-30T11:53:19.2710772Z [36;1mcargo build -p spt --bin translate_proof_fixture[0m
2026-07-30T11:53:19.2716529Z shell: C:\Program Files\PowerShell\7\pwsh.EXE -command ". '{0}'"
2026-07-30T11:53:19.2716847Z ##[endgroup]
2026-07-30T11:53:23.8220209Z    Compiling proc-macro2 v1.0.106
2026-07-30T11:53:23.8221483Z    Compiling unicode-ident v1.0.24
2026-07-30T11:53:23.8221778Z    Compiling quote v1.0.45
2026-07-30T11:53:23.8222644Z    Compiling cfg-if v1.0.4
2026-07-30T11:53:23.8223096Z    Compiling serde_core v1.0.228
2026-07-30T11:53:23.8223641Z    Compiling serde v1.0.228
2026-07-30T11:53:23.8243647Z    Compiling windows-link v0.2.1
2026-07-30T11:53:23.8243981Z    Compiling typenum v1.20.1
2026-07-30T11:53:23.8244419Z    Compiling getrandom v0.3.4
2026-07-30T11:53:23.8250183Z    Compiling pin-project-lite v0.2.17
2026-07-30T11:53:23.8257009Z    Compiling version_check v0.9.5
2026-07-30T11:53:23.8338828Z    Compiling portable-atomic v1.13.1
2026-07-30T11:53:23.8339189Z    Compiling memchr v2.8.1
2026-07-30T11:53:23.8339483Z    Compiling shlex v2.0.1
2026-07-30T11:53:23.8340722Z    Compiling find-msvc-tools v0.1.9
2026-07-30T11:53:23.8341113Z    Compiling critical-section v1.2.0
2026-07-30T11:53:24.0656863Z    Compiling windows-sys v0.61.2
2026-07-30T11:53:24.1122103Z    Compiling subtle v2.6.1
2026-07-30T11:53:24.1395823Z    Compiling futures-core v0.3.32
2026-07-30T11:53:24.3504483Z    Compiling smallvec v1.15.1
2026-07-30T11:53:24.6006223Z    Compiling equivalent v1.0.2
2026-07-30T11:53:24.6351423Z    Compiling generic-array v0.14.7
2026-07-30T11:53:25.0669407Z    Compiling itoa v1.0.18
2026-07-30T11:53:25.3687981Z    Compiling bytes v1.11.1
2026-07-30T11:53:25.5131307Z    Compiling semver v1.0.28
2026-07-30T11:53:25.5260565Z    Compiling stable_deref_trait v1.2.1
2026-07-30T11:53:25.5896103Z    Compiling log v0.4.32
2026-07-30T11:53:25.7501345Z    Compiling futures-io v0.3.32
2026-07-30T11:53:26.1475482Z    Compiling slab v0.4.12
2026-07-30T11:53:26.1586897Z    Compiling futures-sink v0.3.32
2026-07-30T11:53:27.0077151Z    Compiling rustversion v1.0.22
2026-07-30T11:53:27.0707198Z    Compiling rand_core v0.10.1
2026-07-30T11:53:27.2279468Z    Compiling futures-task v0.3.32
2026-07-30T11:53:27.2975558Z    Compiling hashbrown v0.17.1
2026-07-30T11:53:27.3884753Z    Compiling futures-channel v0.3.32
2026-07-30T11:53:27.4310441Z    Compiling getrandom v0.2.17
2026-07-30T11:53:27.4884640Z    Compiling jobserver v0.1.34
2026-07-30T11:53:27.4885146Z    Compiling rustc_version v0.4.1
2026-07-30T11:53:27.4910823Z    Compiling cpufeatures v0.2.17
2026-07-30T11:53:27.5157898Z    Compiling fnv v1.0.7
2026-07-30T11:53:27.6624343Z    Compiling getrandom v0.4.2
2026-07-30T11:53:27.7825421Z    Compiling cc v1.2.63
2026-07-30T11:53:27.7860656Z    Compiling libc v0.2.186
2026-07-30T11:53:27.9260536Z    Compiling cfg_aliases v0.2.1
2026-07-30T11:53:27.9260971Z    Compiling strsim v0.11.1
2026-07-30T11:53:27.9526899Z    Compiling autocfg v1.5.1
2026-07-30T11:53:27.9527668Z    Compiling litemap v0.8.2
2026-07-30T11:53:28.0320920Z    Compiling writeable v0.6.3
2026-07-30T11:53:28.0396339Z    Compiling fs_extra v1.3.0
2026-07-30T11:53:28.0670402Z    Compiling icu_normalizer_data v2.2.0
2026-07-30T11:53:28.2351018Z    Compiling utf8_iter v1.0.4
2026-07-30T11:53:28.3640274Z    Compiling indexmap v2.14.0
2026-07-30T11:53:28.4158672Z    Compiling syn v2.0.117
2026-07-30T11:53:28.5018324Z    Compiling crypto-common v0.1.7
2026-07-30T11:53:28.5147875Z    Compiling icu_properties_data v2.2.0
2026-07-30T11:53:28.5651090Z    Compiling dunce v1.0.5
2026-07-30T11:53:28.5651542Z    Compiling ident_case v1.0.1
2026-07-30T11:53:28.6336772Z    Compiling percent-encoding v2.3.2
2026-07-30T11:53:28.7092288Z    Compiling http v1.4.1
2026-07-30T11:53:28.7480382Z    Compiling unicode-segmentation v1.13.3
2026-07-30T11:53:28.7634100Z    Compiling cpufeatures v0.3.0
2026-07-30T11:53:28.7715660Z    Compiling thiserror v2.0.18
2026-07-30T11:53:28.7729974Z    Compiling aws-lc-rs v1.17.0
2026-07-30T11:53:28.8469952Z    Compiling scopeguard v1.2.0
2026-07-30T11:53:28.8884665Z    Compiling cmake v0.1.58
2026-07-30T11:53:29.2172766Z    Compiling lock_api v0.4.14
2026-07-30T11:53:29.2346297Z    Compiling form_urlencoded v1.2.2
2026-07-30T11:53:29.2379544Z    Compiling chacha20 v0.10.0
2026-07-30T11:53:29.3216196Z    Compiling block-buffer v0.10.4
2026-07-30T11:53:29.3276973Z    Compiling winapi v0.3.9
2026-07-30T11:53:29.4814702Z    Compiling untrusted v0.9.0
2026-07-30T11:53:29.5931694Z    Compiling bitflags v2.12.1
2026-07-30T11:53:29.6010549Z    Compiling num-traits v0.2.19
2026-07-30T11:53:29.6349324Z    Compiling windows-result v0.4.1
2026-07-30T11:53:29.6527752Z    Compiling windows-strings v0.5.1
2026-07-30T11:53:29.6571543Z    Compiling digest v0.10.7
2026-07-30T11:53:29.7885105Z    Compiling rand v0.10.1
2026-07-30T11:53:29.8454832Z    Compiling heck v0.5.0
2026-07-30T11:53:29.8678359Z    Compiling rustls v0.23.40
2026-07-30T11:53:29.8992739Z    Compiling convert_case v0.10.0
2026-07-30T11:53:30.0106397Z    Compiling atomic-waker v1.1.2
2026-07-30T11:53:30.1972821Z    Compiling unicode-xid v0.2.6
2026-07-30T11:53:30.2028698Z    Compiling anyhow v1.0.102
2026-07-30T11:53:30.2454121Z    Compiling aws-lc-sys v0.41.0
2026-07-30T11:53:30.2881570Z    Compiling ring v0.17.14
2026-07-30T11:53:30.3740753Z    Compiling const-oid v0.10.2
2026-07-30T11:53:30.3832332Z    Compiling zerocopy v0.8.50
2026-07-30T11:53:30.4471364Z    Compiling httparse v1.10.1
2026-07-30T11:53:30.4564978Z    Compiling parking_lot_core v0.9.12
2026-07-30T11:53:30.5377537Z    Compiling http-body v1.0.1
2026-07-30T11:53:30.6365228Z    Compiling curve25519-dalek v4.1.3
2026-07-30T11:53:30.7001076Z    Compiling hybrid-array v0.4.12
2026-07-30T11:53:30.7183355Z    Compiling ahash v0.8.12
2026-07-30T11:53:30.8756501Z    Compiling base64ct v1.8.3
2026-07-30T11:53:30.9738674Z    Compiling either v1.16.0
2026-07-30T11:53:31.0677001Z    Compiling powerfmt v0.2.0
2026-07-30T11:53:31.6941646Z    Compiling uuid v1.23.2
2026-07-30T11:53:31.8244312Z    Compiling pem-rfc7468 v1.0.0
2026-07-30T11:53:32.0521939Z    Compiling deranged v0.5.8
2026-07-30T11:53:32.0522336Z    Compiling rand_core v0.6.4
2026-07-30T11:53:32.3972889Z    Compiling try-lock v0.2.5
2026-07-30T11:53:32.5308710Z    Compiling synstructure v0.13.2
2026-07-30T11:53:32.9370651Z    Compiling darling_core v0.20.11
2026-07-30T11:53:33.1242284Z    Compiling socket2 v0.6.4
2026-07-30T11:53:33.1473625Z    Compiling mio v1.2.1
2026-07-30T11:53:33.5238663Z    Compiling tower-service v0.3.3
2026-07-30T11:53:33.5604901Z    Compiling data-encoding v2.11.0
2026-07-30T11:53:33.6819918Z    Compiling fastrand v2.4.1
2026-07-30T11:53:33.7193184Z    Compiling vcpkg v0.2.15
2026-07-30T11:53:33.7353574Z    Compiling num-conv v0.2.2
2026-07-30T11:53:33.7887887Z    Compiling zmij v1.0.21
2026-07-30T11:53:34.1930200Z    Compiling base64 v0.22.1
2026-07-30T11:53:34.3719598Z    Compiling tinyvec_macros v0.1.1
2026-07-30T11:53:34.4212325Z    Compiling pkg-config v0.3.33
2026-07-30T11:53:34.5459025Z    Compiling serde_derive v1.0.228
2026-07-30T11:53:34.9178544Z    Compiling zeroize_derive v1.4.3
2026-07-30T11:53:34.9595614Z    Compiling zerofrom-derive v0.1.7
2026-07-30T11:53:35.1821362Z    Compiling yoke-derive v0.8.2
2026-07-30T11:53:35.9057011Z    Compiling tokio-macros v2.7.0
2026-07-30T11:53:35.9069253Z    Compiling futures-macro v0.3.32
2026-07-30T11:53:36.2356386Z    Compiling zerovec-derive v0.11.3
2026-07-30T11:53:36.2792385Z    Compiling displaydoc v0.2.6
2026-07-30T11:53:36.4381631Z    Compiling tracing-attributes v0.1.31
2026-07-30T11:53:36.5691776Z    Compiling thiserror-impl v2.0.18
2026-07-30T11:53:36.7822432Z    Compiling curve25519-dalek-derive v0.1.1
2026-07-30T11:53:36.8518055Z    Compiling darling_macro v0.20.11
2026-07-30T11:53:36.9194772Z    Compiling derive_more-impl v2.1.1
2026-07-30T11:53:36.9505863Z    Compiling zeroize v1.8.2
2026-07-30T11:53:37.6453998Z    Compiling futures-util v0.3.32
2026-07-30T11:53:37.6865806Z    Compiling rustls-pki-types v1.14.1
2026-07-30T11:53:37.6877476Z    Compiling tokio v1.52.3
2026-07-30T11:53:37.8483515Z    Compiling windows-implement v0.60.2
2026-07-30T11:53:37.9684777Z    Compiling windows-interface v0.59.3
2026-07-30T11:53:37.9925105Z    Compiling darling v0.20.11
2026-07-30T11:53:37.9964427Z    Compiling zerofrom v0.1.8
2026-07-30T11:53:38.1332604Z    Compiling spez v0.1.2
2026-07-30T11:53:38.1351147Z    Compiling n0-error-macros v0.1.3
2026-07-30T11:53:38.1473412Z    Compiling time-core v0.1.8
2026-07-30T11:53:38.7704774Z    Compiling der v0.8.0-rc.10
2026-07-30T11:53:39.2356102Z    Compiling derive_builder_core v0.20.2
2026-07-30T11:53:39.5082777Z    Compiling yoke v0.8.3
2026-07-30T11:53:39.6540535Z    Compiling libsqlite3-sys v0.30.1
2026-07-30T11:53:40.1551776Z    Compiling tinyvec v1.11.0
2026-07-30T11:53:40.1552221Z    Compiling zerovec v0.11.6
2026-07-30T11:53:40.2223602Z    Compiling zerotrie v0.2.4
2026-07-30T11:53:40.3307400Z    Compiling windows-core v0.62.2
2026-07-30T11:53:40.6309628Z    Compiling ipnet v2.12.0
2026-07-30T11:53:40.8153196Z    Compiling pin-project-internal v1.1.13
2026-07-30T11:53:40.8864458Z    Compiling n0-error v0.1.3
2026-07-30T11:53:40.9347701Z    Compiling tinystr v0.8.3
2026-07-30T11:53:40.9671644Z    Compiling potential_utf v0.1.5
2026-07-30T11:53:41.0162429Z    Compiling want v0.3.1
2026-07-30T11:53:41.0257830Z    Compiling derive_builder_macro v0.20.2
2026-07-30T11:53:41.0258288Z    Compiling parking_lot v0.12.5
2026-07-30T11:53:41.3555280Z    Compiling once_cell v1.21.4
2026-07-30T11:53:41.3555716Z    Compiling icu_locale_core v2.2.0
2026-07-30T11:53:41.3599303Z    Compiling icu_collections v2.2.0
2026-07-30T11:53:41.3958429Z    Compiling block-buffer v0.12.0
2026-07-30T11:53:41.4126872Z    Compiling crypto-common v0.2.2
2026-07-30T11:53:41.6054451Z    Compiling tracing-core v0.1.36
2026-07-30T11:53:41.6388537Z    Compiling sha2 v0.10.9
2026-07-30T11:53:41.7601602Z    Compiling vergen-lib v9.1.0
2026-07-30T11:53:41.8576195Z    Compiling inout v0.1.4
2026-07-30T11:53:41.9042916Z    Compiling n0-future v0.3.2
2026-07-30T11:53:41.9343035Z    Compiling httpdate v1.0.3
2026-07-30T11:53:41.9678542Z    Compiling derive_builder v0.20.2
2026-07-30T11:53:42.0052866Z    Compiling parking v2.2.1
2026-07-30T11:53:42.0415115Z    Compiling derive_more v2.1.1
2026-07-30T11:53:42.1013541Z    Compiling signature v2.2.0
2026-07-30T11:53:42.1712756Z    Compiling tracing v0.1.44
2026-07-30T11:53:42.2899436Z    Compiling diatomic-waker v0.2.3
2026-07-30T11:53:42.3694625Z    Compiling icu_provider v2.2.0
2026-07-30T11:53:42.4206552Z    Compiling windows_x86_64_msvc v0.52.6
2026-07-30T11:53:42.4207044Z    Compiling crossbeam-utils v0.8.21
2026-07-30T11:53:42.4455453Z    Compiling winnow v1.0.3
2026-07-30T11:53:42.5454209Z    Compiling tokio-util v0.7.18
2026-07-30T11:53:42.5583180Z    Compiling serde_json v1.0.150
2026-07-30T11:53:42.5901974Z    Compiling cordyceps v0.3.4
2026-07-30T11:53:42.5992891Z    Compiling spin v0.10.0
2026-07-30T11:53:42.6888766Z    Compiling pin-project v1.1.13
2026-07-30T11:53:42.8714372Z    Compiling icu_properties v2.2.0
2026-07-30T11:53:42.9336472Z    Compiling icu_normalizer v2.2.0
2026-07-30T11:53:42.9522194Z    Compiling digest v0.11.3
2026-07-30T11:53:43.0233216Z    Compiling ed25519 v2.2.3
2026-07-30T11:53:43.1574085Z    Compiling futures-buffered v0.2.13
2026-07-30T11:53:43.1610965Z    Compiling futures-lite v2.6.1
2026-07-30T11:53:43.2503569Z    Compiling cipher v0.4.4
2026-07-30T11:53:43.3256198Z    Compiling hashbrown v0.14.5
2026-07-30T11:53:43.3866537Z    Compiling spki v0.8.0-rc.4
2026-07-30T11:53:43.5175391Z    Compiling h2 v0.4.14
2026-07-30T11:53:43.5537805Z    Compiling vergen v9.1.0
2026-07-30T11:53:43.6258799Z    Compiling vergen-lib v0.1.6
2026-07-30T11:53:43.7580890Z    Compiling toml_parser v1.1.2+spec-1.1.0
2026-07-30T11:53:43.7791352Z    Compiling universal-hash v0.5.1
2026-07-30T11:53:43.8151002Z    Compiling noq-udp v0.10.0
2026-07-30T11:53:43.8800779Z    Compiling heapless v0.7.17
2026-07-30T11:53:44.0370070Z    Compiling idna_adapter v1.2.2
2026-07-30T11:53:44.1577030Z    Compiling curve25519-dalek v5.0.0-pre.6
2026-07-30T11:53:44.1783056Z    Compiling sync_wrapper v1.0.2
2026-07-30T11:53:44.2488807Z    Compiling toml_datetime v1.1.1+spec-1.1.0
2026-07-30T11:53:44.3282557Z    Compiling byteorder v1.5.0
2026-07-30T11:53:44.3986425Z    Compiling opaque-debug v0.3.1
2026-07-30T11:53:44.3987145Z    Compiling allocator-api2 v0.2.21
2026-07-30T11:53:44.4693013Z    Compiling idna v1.1.0
2026-07-30T11:53:44.4894246Z    Compiling polyval v0.6.2
2026-07-30T11:53:44.6029303Z    Compiling hash32 v0.2.1
2026-07-30T11:53:44.6811256Z    Compiling toml_edit v0.25.12+spec-1.1.0
2026-07-30T11:53:44.6811684Z    Compiling hashlink v0.9.1
2026-07-30T11:53:44.7868862Z    Compiling url v2.5.8
2026-07-30T11:53:44.8582163Z    Compiling pkcs8 v0.11.0-rc.10
2026-07-30T11:53:45.0180255Z    Compiling ed25519-dalek v2.2.0
2026-07-30T11:53:45.4684986Z    Compiling prefix-trie v0.8.4
2026-07-30T11:53:45.4773653Z    Compiling futures-executor v0.3.32
2026-07-30T11:53:45.5412224Z    Compiling vergen-gitcl v1.0.8
2026-07-30T11:53:45.7534153Z    Compiling spin v0.9.8
2026-07-30T11:53:45.7735102Z    Compiling windows-threading v0.2.1
2026-07-30T11:53:45.9244878Z    Compiling tower-layer v0.3.3
2026-07-30T11:53:46.0506375Z    Compiling signature v3.0.0
2026-07-30T11:53:46.1015581Z    Compiling fallible-streaming-iterator v0.1.9
2026-07-30T11:53:46.5836768Z    Compiling ryu v1.0.23
2026-07-30T11:53:46.5909341Z    Compiling fallible-iterator v0.3.0
2026-07-30T11:53:46.6121787Z    Compiling hickory-proto v0.26.0-beta.4
2026-07-30T11:53:46.6927879Z    Compiling ed25519 v3.0.0-rc.4
2026-07-30T11:53:46.7133779Z    Compiling windows-future v0.3.2
2026-07-30T11:53:46.7824890Z    Compiling futures v0.3.32
2026-07-30T11:53:46.8862173Z    Compiling windows-targets v0.52.6
2026-07-30T11:53:46.9174003Z    Compiling spt-proto v0.46.0 (C:\actions-runner\_work\spt-bs-core\spt-bs-core\crates\spt-proto)
2026-07-30T11:53:47.0038879Z    Compiling proc-macro-crate v3.5.0
2026-07-30T11:53:47.2678338Z    Compiling rusqlite v0.32.1
2026-07-30T11:53:47.4098813Z    Compiling ghash v0.5.1
2026-07-30T11:53:47.4346271Z    Compiling aes v0.8.4
2026-07-30T11:53:47.4792791Z    Compiling ctr v0.9.2
2026-07-30T11:53:47.6482957Z    Compiling hyper v1.10.1
2026-07-30T11:53:47.6483418Z    Compiling data-encoding-macro-internal v0.1.18
2026-07-30T11:53:47.7460684Z    Compiling sha2 v0.11.0-rc.5
2026-07-30T11:53:47.8306197Z    Compiling windows-numerics v0.3.1
2026-07-30T11:53:47.9846309Z    Compiling windows-collections v0.3.2
2026-07-30T11:53:48.0692623Z    Compiling cobs v0.3.0
2026-07-30T11:53:48.2500829Z    Compiling time v0.3.47
2026-07-30T11:53:48.2501257Z    Compiling postcard-derive v0.2.2
2026-07-30T11:53:48.3065767Z    Compiling fs2 v0.4.3
2026-07-30T11:53:48.4521820Z    Compiling http-body-util v0.1.3
2026-07-30T11:53:48.6167559Z    Compiling aead v0.5.2
2026-07-30T11:53:48.9104254Z    Compiling ipconfig v0.3.4
2026-07-30T11:53:48.9804327Z    Compiling widestring v1.2.1
2026-07-30T11:53:49.0158421Z    Compiling arrayvec v0.7.6
2026-07-30T11:53:49.1098579Z    Compiling utf8parse v0.2.2
2026-07-30T11:53:49.1324370Z    Compiling data-encoding-macro v0.1.20
2026-07-30T11:53:49.2750503Z    Compiling aes-gcm v0.10.3
2026-07-30T11:53:49.8136485Z    Compiling hyper-util v0.1.20
2026-07-30T11:53:49.8138894Z    Compiling ed25519-dalek v3.0.0-pre.6
2026-07-30T11:53:49.9665143Z    Compiling windows v0.62.2
2026-07-30T11:53:49.9869086Z    Compiling spt-store v0.46.0 (C:\actions-runner\_work\spt-bs-core\spt-bs-core\crates\spt-store)
2026-07-30T11:53:50.0596089Z    Compiling num_enum_derive v0.7.6
2026-07-30T11:53:50.0696170Z    Compiling postcard v1.1.3
2026-07-30T11:53:50.2823621Z    Compiling windows-sys v0.59.0
2026-07-30T11:53:50.4156349Z    Compiling tower v0.5.3
2026-07-30T11:53:50.4405255Z    Compiling crossbeam-epoch v0.9.18
2026-07-30T11:53:50.4578197Z    Compiling crossbeam-channel v0.5.15
2026-07-30T11:53:51.5323640Z    Compiling chrono v0.4.45
2026-07-30T11:53:52.1188809Z    Compiling enum-assoc v1.3.0
2026-07-30T11:53:52.1204233Z    Compiling strum_macros v0.28.0
2026-07-30T11:53:52.1264861Z    Compiling async-trait v0.1.89
2026-07-30T11:53:52.1766104Z    Compiling iroh-metrics-derive v0.4.1
2026-07-30T11:53:52.3686729Z    Compiling blake3 v1.8.5
2026-07-30T11:53:52.5298030Z    Compiling windows-registry v0.6.1
2026-07-30T11:53:52.5298488Z    Compiling memoffset v0.6.5
2026-07-30T11:53:52.8492175Z    Compiling netwatch v0.16.0
2026-07-30T11:53:53.0947396Z    Compiling noq v0.18.0
2026-07-30T11:53:53.1834502Z    Compiling acto v0.8.2
2026-07-30T11:53:53.1835102Z    Compiling mac-addr v0.3.0
2026-07-30T11:53:53.2057391Z    Compiling sorted-index-buffer v0.2.1
2026-07-30T11:53:53.3472261Z    Compiling xml-rs v0.8.28
2026-07-30T11:53:53.5358872Z    Compiling lru-slab v0.1.2
2026-07-30T11:53:53.5912955Z    Compiling identity-hash v0.1.0
2026-07-30T11:53:53.6150139Z    Compiling rustc-hash v2.1.2
2026-07-30T11:53:53.6883542Z    Compiling ref-cast v1.0.25
2026-07-30T11:53:53.8177993Z    Compiling foldhash v0.2.0
2026-07-30T11:53:53.8687403Z    Compiling tagptr v0.2.0
2026-07-30T11:53:53.9475176Z    Compiling thiserror v1.0.69
2026-07-30T11:53:54.0531285Z    Compiling netdev v0.42.0
2026-07-30T11:53:54.1604276Z    Compiling hashbrown v0.16.1
2026-07-30T11:53:54.4140318Z    Compiling xmltree v0.10.3
2026-07-30T11:53:54.5868801Z    Compiling moka v0.12.15
2026-07-30T11:53:54.8951094Z    Compiling spt-msg v0.46.0 (C:\actions-runner\_work\spt-bs-core\spt-bs-core\crates\spt-msg)
2026-07-30T11:53:55.2691199Z    Compiling iroh-metrics v0.38.3
2026-07-30T11:53:55.4428541Z    Compiling num_enum v0.7.6
2026-07-30T11:53:55.4526345Z    Compiling strum v0.28.0
2026-07-30T11:53:56.2890022Z    Compiling iroh-relay v0.98.0
2026-07-30T11:53:56.9468910Z    Compiling tower-http v0.6.11
2026-07-30T11:53:56.9675724Z    Compiling iroh-base v0.98.0
2026-07-30T11:53:56.9850398Z    Compiling attohttpc v0.30.1
2026-07-30T11:53:57.0568369Z    Compiling n0-watcher v0.6.1
2026-07-30T11:53:57.4572673Z    Compiling tokio-stream v0.1.18
2026-07-30T11:53:57.6573029Z    Compiling toml_datetime v0.6.11
2026-07-30T11:53:57.6940488Z    Compiling serde_spanned v0.6.9
2026-07-30T11:53:57.9719188Z    Compiling thiserror-impl v1.0.69
2026-07-30T11:53:58.0935096Z    Compiling ref-cast-impl v1.0.25
2026-07-30T11:53:58.4813795Z    Compiling serde_derive_internals v0.29.1
2026-07-30T11:53:58.5707161Z    Compiling simple-dns v0.9.3
2026-07-30T11:53:58.6586357Z    Compiling serial-core v0.4.0
2026-07-30T11:53:58.7115770Z    Compiling aho-corasick v1.1.4
2026-07-30T11:53:59.1133041Z    Compiling smol_str v0.1.24
2026-07-30T11:53:59.1133422Z    Compiling toml_write v0.1.2
2026-07-30T11:53:59.1780769Z    Compiling regex-syntax v0.8.10
2026-07-30T11:53:59.3224596Z    Compiling sha1_smol v1.0.1
2026-07-30T11:53:59.3623507Z    Compiling resolv-conf v0.7.6
2026-07-30T11:53:59.3999610Z    Compiling arrayref v0.3.9
2026-07-30T11:53:59.6731874Z    Compiling winnow v0.7.15
2026-07-30T11:53:59.8610240Z    Compiling simdutf8 v0.1.5
2026-07-30T11:53:59.8748486Z    Compiling constant_time_eq v0.4.2
2026-07-30T11:53:59.9074691Z    Compiling winreg v0.10.1
2026-07-30T11:53:59.9126872Z    Compiling iroh-dns v0.98.0
2026-07-30T11:54:00.4770477Z    Compiling schemars_derive v1.2.1
2026-07-30T11:54:00.6602871Z    Compiling wmi v0.18.4
2026-07-30T11:54:01.0155654Z    Compiling serial-windows v0.4.0
2026-07-30T11:54:01.2056004Z    Compiling igd-next v0.17.1
2026-07-30T11:54:01.3545313Z    Compiling lru v0.16.4
2026-07-30T11:54:01.7488157Z    Compiling toml_edit v0.22.27
2026-07-30T11:54:01.7877447Z    Compiling regex-automata v0.4.14
2026-07-30T11:54:01.9371300Z    Compiling webpki-roots v1.0.7
2026-07-30T11:54:02.0410940Z    Compiling seize v0.5.1
2026-07-30T11:54:02.0503288Z    Compiling darling_core v0.23.0
2026-07-30T11:54:02.7179350Z    Compiling hmac v0.12.1
2026-07-30T11:54:02.7802603Z    Compiling serde_bytes v0.11.19
2026-07-30T11:54:03.1162888Z    Compiling iroh v0.98.2
2026-07-30T11:54:03.3715438Z    Compiling bitflags v1.3.2
2026-07-30T11:54:03.4777372Z    Compiling anstyle v1.0.14
2026-07-30T11:54:03.5027938Z    Compiling lazy_static v1.5.0
2026-07-30T11:54:03.7030955Z    Compiling once_cell_polyfill v1.70.2
2026-07-30T11:54:03.8991691Z    Compiling cmov v0.5.4
2026-07-30T11:54:03.9205918Z    Compiling dyn-clone v1.0.20
2026-07-30T11:54:04.2929278Z    Compiling pin-utils v0.1.0
2026-07-30T11:54:04.8409354Z    Compiling regex v1.12.3
2026-07-30T11:54:05.4297663Z    Compiling shared_library v0.1.9
2026-07-30T11:54:05.4476962Z    Compiling toml v0.8.23
2026-07-30T11:54:05.4687978Z    Compiling portmapper v0.16.0
2026-07-30T11:54:05.9603740Z    Compiling ctutils v0.4.2
2026-07-30T11:54:05.9604578Z    Compiling schemars v1.2.1
2026-07-30T11:54:05.9665346Z    Compiling nix v0.25.1
2026-07-30T11:54:05.9737829Z    Compiling anstyle-wincon v3.0.11
2026-07-30T11:54:05.9949891Z    Compiling hkdf v0.12.4
2026-07-30T11:54:06.1985824Z    Compiling papaya v0.2.4
2026-07-30T11:54:06.2221002Z    Compiling darling_macro v0.23.0
2026-07-30T11:54:06.2303317Z    Compiling filedescriptor v0.8.3
2026-07-30T11:54:06.5870026Z    Compiling serial v0.4.0
2026-07-30T11:54:06.6574635Z    Compiling swarm-discovery v0.6.0-alpha.2
2026-07-30T11:54:07.1231997Z    Compiling anstyle-parse v1.0.0
2026-07-30T11:54:07.1348172Z    Compiling backon v1.6.0
2026-07-30T11:54:07.1882058Z    Compiling anstyle-query v1.1.5
2026-07-30T11:54:07.3896514Z    Compiling vte_generate_state_changes v0.1.2
2026-07-30T11:54:07.4481739Z    Compiling instability v0.3.12
2026-07-30T11:54:07.4574430Z    Compiling shell-words v1.1.1
2026-07-30T11:54:07.6051779Z    Compiling unicode-width v0.2.0
2026-07-30T11:54:07.6207258Z    Compiling downcast-rs v1.2.1
2026-07-30T11:54:07.7216223Z    Compiling is_terminal_polyfill v1.70.2
2026-07-30T11:54:08.1013802Z    Compiling colorchoice v1.0.5
2026-07-30T11:54:08.2782600Z    Compiling paste v1.0.15
2026-07-30T11:54:08.5882313Z    Compiling foldhash v0.1.5
2026-07-30T11:54:08.7664557Z    Compiling darling v0.23.0
2026-07-30T11:54:08.7802693Z    Compiling spt-runtime v0.46.0 (C:\actions-runner\_work\spt-bs-core\spt-bs-core\crates\spt-runtime)
2026-07-30T11:54:08.8647653Z    Compiling spake2 v0.4.0
2026-07-30T11:54:09.3305256Z    Compiling strum_macros v0.26.4
2026-07-30T11:54:10.0375631Z    Compiling crossterm_winapi v0.9.1
2026-07-30T11:54:10.1231921Z    Compiling portable-pty v0.8.1
2026-07-30T11:54:10.1273899Z    Compiling terminal_size v0.4.4
2026-07-30T11:54:10.1580122Z    Compiling anstream v1.0.0
2026-07-30T11:54:10.2686551Z    Compiling vte v0.13.1
2026-07-30T11:54:10.7422427Z    Compiling hashbrown v0.15.5
2026-07-30T11:54:10.9139494Z    Compiling itertools v0.13.0
2026-07-30T11:54:10.9217309Z    Compiling sha1 v0.10.6
2026-07-30T11:54:11.2629999Z    Compiling castaway v0.2.4
2026-07-30T11:54:11.2883341Z    Compiling doctest-file v1.1.1
2026-07-30T11:54:11.3037652Z    Compiling indoc v2.0.7
2026-07-30T11:54:11.3551384Z    Compiling clap_lex v1.1.0
2026-07-30T11:54:11.6127117Z    Compiling unicode-width v0.1.14
2026-07-30T11:54:11.6866093Z    Compiling static_assertions v1.1.0
2026-07-30T11:54:11.7408211Z    Compiling recvmsg v1.0.0
2026-07-30T11:54:11.8332888Z    Compiling spt-term v0.46.0 (C:\actions-runner\_work\spt-bs-core\spt-bs-core\crates\spt-term)
2026-07-30T11:54:11.9093550Z    Compiling clap_builder v4.6.0
2026-07-30T11:54:12.0992129Z    Compiling compact_str v0.8.2
2026-07-30T11:54:12.1234049Z    Compiling lru v0.12.5
2026-07-30T11:54:12.1234537Z    Compiling crossterm v0.28.1
2026-07-30T11:54:12.4365774Z    Compiling clap_derive v4.6.1
2026-07-30T11:54:12.4814268Z    Compiling error-code v3.3.2
2026-07-30T11:54:12.6056620Z    Compiling cassowary v0.3.0
2026-07-30T11:54:12.6869231Z    Compiling clipboard-win v5.4.1
2026-07-30T11:54:12.7832905Z    Compiling nucleo-matcher v0.3.1
2026-07-30T11:54:12.8197660Z    Compiling interprocess v2.4.2
2026-07-30T11:54:12.8681238Z    Compiling qrcode v0.14.1
2026-07-30T11:54:13.3018706Z    Compiling unicode-truncate v1.1.0
2026-07-30T11:54:13.4468828Z    Compiling spt-live v0.46.0 (C:\actions-runner\_work\spt-bs-core\spt-bs-core\crates\spt-live)
2026-07-30T11:54:14.1978267Z    Compiling strum v0.26.3
2026-07-30T11:54:14.5951563Z    Compiling ratatui v0.29.0
2026-07-30T11:54:15.7538125Z    Compiling clap v4.6.1
2026-07-30T11:54:31.8552927Z    Compiling rustls-webpki v0.103.13
2026-07-30T11:54:34.6664309Z    Compiling tokio-rustls v0.26.4
2026-07-30T11:54:34.6664728Z    Compiling noq-proto v0.17.0
2026-07-30T11:54:34.6665088Z    Compiling rustls-platform-verifier v0.7.0
2026-07-30T11:54:35.2455019Z    Compiling hyper-rustls v0.27.9
2026-07-30T11:54:35.2456732Z    Compiling hickory-net v0.26.0-beta.4
2026-07-30T11:54:35.2457179Z    Compiling tokio-websockets v0.13.2
2026-07-30T11:54:35.4570387Z    Compiling reqwest v0.13.4
2026-07-30T11:54:36.9396411Z    Compiling hickory-resolver v0.26.0-beta.4
2026-07-30T11:54:56.4524014Z    Compiling spt-net v0.46.0 (C:\actions-runner\_work\spt-bs-core\spt-bs-core\crates\spt-net)
2026-07-30T11:54:58.1997684Z    Compiling spt-daemon v0.46.0 (C:\actions-runner\_work\spt-bs-core\spt-bs-core\crates\spt-daemon)
2026-07-30T11:55:12.4542435Z    Compiling spt v0.46.0 (C:\actions-runner\_work\spt-bs-core\spt-bs-core\crates\spt)
2026-07-30T11:55:12.7770377Z     Finished `dev` profile [unoptimized + debuginfo] target(s) in 1m 53s
2026-07-30T11:55:12.9583693Z ##[group]Run cargo test --workspace --lib --bins
2026-07-30T11:55:12.9584206Z [36;1mcargo test --workspace --lib --bins[0m
2026-07-30T11:55:12.9592620Z shell: C:\Program Files\PowerShell\7\pwsh.EXE -command ". '{0}'"
2026-07-30T11:55:12.9593089Z ##[endgroup]
2026-07-30T11:55:14.1902713Z    Compiling fastrand v2.4.1
2026-07-30T11:55:14.2337207Z    Compiling bytemuck v1.25.2
2026-07-30T11:55:14.2390522Z    Compiling mock-adapter v0.46.0 (C:\actions-runner\_work\spt-bs-core\spt-bs-core\adapters\mock)
2026-07-30T11:55:14.2391315Z    Compiling spt-proto v0.46.0 (C:\actions-runner\_work\spt-bs-core\spt-bs-core\crates\spt-proto)
2026-07-30T11:55:14.3780118Z    Compiling futures-lite v2.6.1
2026-07-30T11:55:14.3780488Z    Compiling tempfile v3.27.0
2026-07-30T11:55:14.3780790Z    Compiling backon v1.6.0
2026-07-30T11:55:14.3797396Z    Compiling rgb v0.8.53
2026-07-30T11:55:14.6390406Z    Compiling spt-test-support v0.46.0 (C:\actions-runner\_work\spt-bs-core\spt-bs-core\crates\spt-test-support)
2026-07-30T11:55:14.7520714Z    Compiling avt v0.18.0
2026-07-30T11:55:14.8294807Z    Compiling spt-store v0.46.0 (C:\actions-runner\_work\spt-bs-core\spt-bs-core\crates\spt-store)
2026-07-30T11:55:14.8295601Z    Compiling spt-live v0.46.0 (C:\actions-runner\_work\spt-bs-core\spt-bs-core\crates\spt-live)
2026-07-30T11:55:14.8296310Z    Compiling spt-runtime v0.46.0 (C:\actions-runner\_work\spt-bs-core\spt-bs-core\crates\spt-runtime)
2026-07-30T11:55:14.9155700Z    Compiling spt-msg v0.46.0 (C:\actions-runner\_work\spt-bs-core\spt-bs-core\crates\spt-msg)
2026-07-30T11:55:15.1660275Z    Compiling n0-future v0.3.2
2026-07-30T11:55:15.3016102Z    Compiling n0-watcher v0.6.1
2026-07-30T11:55:15.3018490Z    Compiling iroh-dns v0.98.0
2026-07-30T11:55:15.5157084Z    Compiling netwatch v0.16.0
2026-07-30T11:55:15.8792473Z    Compiling spt-term v0.46.0 (C:\actions-runner\_work\spt-bs-core\spt-bs-core\crates\spt-term)
2026-07-30T11:55:15.9088507Z    Compiling iroh-relay v0.98.0
2026-07-30T11:55:16.4788916Z    Compiling portmapper v0.16.0
2026-07-30T11:55:22.4546714Z    Compiling iroh v0.98.2
2026-07-30T11:55:34.4376663Z    Compiling spt-net v0.46.0 (C:\actions-runner\_work\spt-bs-core\spt-bs-core\crates\spt-net)
2026-07-30T11:55:36.2231690Z    Compiling spt-daemon v0.46.0 (C:\actions-runner\_work\spt-bs-core\spt-bs-core\crates\spt-daemon)
2026-07-30T11:55:52.9185151Z    Compiling spt v0.46.0 (C:\actions-runner\_work\spt-bs-core\spt-bs-core\crates\spt)
2026-07-30T11:55:52.9185952Z    Compiling xtask v0.46.0 (C:\actions-runner\_work\spt-bs-core\spt-bs-core\crates\xtask)
2026-07-30T11:56:07.5139571Z     Finished `test` profile [unoptimized + debuginfo] target(s) in 54.05s
2026-07-30T11:56:07.5530820Z      Running unittests src\capture_player.rs (target\debug\deps\capture_player-6b307b263764b8df.exe)
2026-07-30T11:56:07.6321401Z 
2026-07-30T11:56:07.6321787Z running 2 tests
2026-07-30T11:56:07.6328628Z test tests::parses_a_well_formed_record ... ok
2026-07-30T11:56:07.6329090Z test tests::refuses_a_length_mismatch ... ok
2026-07-30T11:56:07.6329307Z 
2026-07-30T11:56:07.6329623Z test result: ok. 2 passed; 0 failed; 0 ignored; 0 measured; 0 filtered out; finished in 0.00s
2026-07-30T11:56:07.6330028Z 
2026-07-30T11:56:07.6337557Z      Running unittests src\console_mode_probe.rs (target\debug\deps\console_mode_probe-a9f526a6be9fccbf.exe)
2026-07-30T11:56:07.7059127Z 
2026-07-30T11:56:07.7059608Z running 0 tests
2026-07-30T11:56:07.7059802Z 
2026-07-30T11:56:07.7060133Z test result: ok. 0 passed; 0 failed; 0 ignored; 0 measured; 0 filtered out; finished in 0.00s
2026-07-30T11:56:07.7060512Z 
2026-07-30T11:56:07.7073605Z      Running unittests src\main.rs (target\debug\deps\mock_session-b089d00d339b4adb.exe)
2026-07-30T11:56:07.7778539Z 
2026-07-30T11:56:07.7779081Z running 0 tests
2026-07-30T11:56:07.7779285Z 
2026-07-30T11:56:07.7779636Z test result: ok. 0 passed; 0 failed; 0 ignored; 0 measured; 0 filtered out; finished in 0.00s
2026-07-30T11:56:07.7780061Z 
2026-07-30T11:56:07.7793225Z      Running unittests src\shell.rs (target\debug\deps\mock_shell-99bb9613e97e27e7.exe)
2026-07-30T11:56:07.8479721Z 
2026-07-30T11:56:07.8480124Z running 0 tests
2026-07-30T11:56:07.8480293Z 
2026-07-30T11:56:07.8480538Z test result: ok. 0 passed; 0 failed; 0 ignored; 0 measured; 0 filtered out; finished in 0.00s
2026-07-30T11:56:07.8480807Z 
2026-07-30T11:56:07.8494222Z      Running unittests tests\fixtures\gh_fixture.rs (target\debug\deps\gh_fixture-f8e122e00d6de927.exe)
2026-07-30T11:56:08.0209032Z 
2026-07-30T11:56:08.0209478Z running 0 tests
2026-07-30T11:56:08.0209725Z 
2026-07-30T11:56:08.0210054Z test result: ok. 0 passed; 0 failed; 0 ignored; 0 measured; 0 filtered out; finished in 0.00s
2026-07-30T11:56:08.0210485Z 
2026-07-30T11:56:08.0229534Z      Running unittests tests\fixtures\git_fixture.rs (target\debug\deps\git_fixture-4491f0823c70b226.exe)
2026-07-30T11:56:08.1023921Z 
2026-07-30T11:56:08.1024368Z running 0 tests
2026-07-30T11:56:08.1024509Z 
2026-07-30T11:56:08.1024754Z test result: ok. 0 passed; 0 failed; 0 ignored; 0 measured; 0 filtered out; finished in 0.00s
2026-07-30T11:56:08.1025009Z 
2026-07-30T11:56:08.1036268Z      Running unittests tests\fixtures\post_step_fixture.rs (target\debug\deps\post_step_fixture-2d7d3b1def7b7592.exe)
2026-07-30T11:56:08.1896572Z 
2026-07-30T11:56:08.1897057Z running 0 tests
2026-07-30T11:56:08.1897300Z 
2026-07-30T11:56:08.1897600Z test result: ok. 0 passed; 0 failed; 0 ignored; 0 measured; 0 filtered out; finished in 0.00s
2026-07-30T11:56:08.1897977Z 
2026-07-30T11:56:08.1914847Z      Running unittests src\main.rs (target\debug\deps\spt-5d1d7e76c38d2532.exe)
2026-07-30T11:56:09.0052147Z 
2026-07-30T11:56:09.0052616Z running 469 tests
2026-07-30T11:56:09.0062496Z test api::auth::tests::mints_distinct_nonempty_tokens ... ok
2026-07-30T11:56:09.0321361Z test api::auth::tests::dead_owner_repin_refused_when_sid_is_a_psyche_custody_sid ... ok
2026-07-30T11:56:09.0551550Z test api::auth::tests::dead_owner_repin_refused_when_sid_owns_another_perch ... ok
2026-07-30T11:56:09.0841957Z test api::auth::tests::dead_owner_repin_still_rescues_a_non_custody_sid ... ok
2026-07-30T11:56:09.1080409Z test api::auth::tests::pinned_to_dead_sid_mismatched_poll_repins ... ok
2026-07-30T11:56:09.1210581Z test api::auth::tests::missing_endpoint_is_no_endpoint ... ok
2026-07-30T11:56:09.1216276Z test api::auth::tests::token_auth_path_unchanged ... ok
2026-07-30T11:56:09.1224585Z test api::delivery::tests::inject_resolution_drops_pty_defaults_hook ... ok
2026-07-30T11:56:09.1225136Z test api::delivery::tests::inject_all_pty_falls_back_to_hook ... ok
2026-07-30T11:56:09.1426379Z test api::auth::tests::worker_stored_sid_authenticates ... ok
2026-07-30T11:56:09.1560363Z test api::auth::tests::live_owner_mismatch_still_refuses ... ok
2026-07-30T11:56:09.1695260Z test api::auth::tests::session_id_proof_authenticates ... ok
2026-07-30T11:56:09.1825505Z test api::auth::tests::worker_missing_is_no_endpoint ... ok
2026-07-30T11:56:09.1829432Z test api::auth::tests::token_proof_authenticates ... ok
2026-07-30T11:56:09.2045125Z test api::auth::tests::worker_parent_current_sid_authenticates_after_rotation ... ok
2026-07-30T11:56:09.2046421Z test api::engineroom::tests::a_refresh_adopts_only_a_real_divergence ... ok
2026-07-30T11:56:09.2051338Z test api::engineroom::tests::an_admin_code_verifies_across_the_ceremony_window_only ... ok
2026-07-30T11:56:09.2052589Z test api::engineroom::tests::subnet_authority_is_the_empowerment_not_the_gate ... ok
2026-07-30T11:56:09.2053854Z test api::engineroom::tests::the_gate_admits_only_the_reserved_id_provisioned_and_authenticated ... ok
2026-07-30T11:56:09.2055676Z test api::engineroom::tests::the_written_node_mode_is_the_one_the_chain_reads ... ok
2026-07-30T11:56:09.2175381Z test api::auth::tests::no_proof_is_refused ... ok
2026-07-30T11:56:09.2371753Z test api::auth::tests::worker_wrong_sid_and_token_only_refused ... ok
2026-07-30T11:56:09.2472658Z test api::auth::tests::wrong_token_and_wrong_session_refused ... ok
2026-07-30T11:56:09.2828776Z test api::delivery::tests::an_undated_state_is_dated_by_a_non_edge_report ... ok
2026-07-30T11:56:09.2881196Z test api::delivery::tests::echo_gate_explicit_toggle ... ok
2026-07-30T11:56:09.3027456Z test api::delivery::tests::idle_busy_transitions_manage_sentinels ... ok
2026-07-30T11:56:09.4114470Z test api::delivery::tests::idle_drain_peek_returns_non_deferred_rows_only ... ok
2026-07-30T11:56:09.4117611Z test api::reporting::tests::capability_lists_hostable_types ... ok
2026-07-30T11:56:09.4204216Z test api::delivery::tests::idle_no_gate_does_not_arm_gate ... ok
2026-07-30T11:56:09.5023914Z test api::delivery::tests::only_a_real_state_edge_stamps_the_transition_instant ... ok
2026-07-30T11:56:09.6707230Z test api::delivery::tests::poll_drain_holds_deferred_while_resting_and_releases_once_on_wake ... ok
2026-07-30T11:56:09.6708852Z test api::reporting::tests::endpoint_info_attached_node_from_honest_stamps ... ok
2026-07-30T11:56:09.6710126Z test api::reporting::tests::endpoint_info_attached_node_self_attributes_own_node_driver ... ok
2026-07-30T11:56:09.6712712Z test api::reporting::tests::endpoint_info_json_always_carries_an_activity_word ... ok
2026-07-30T11:56:09.8417966Z test api::delivery::tests::poll_drain_suppresses_idle_only_which_reaches_the_relay ... ok
2026-07-30T11:56:09.8423363Z test api::reporting::tests::env_aliases_resolved_from_manifest ... ok
2026-07-30T11:56:10.0321335Z test api::delivery::tests::poll_drain_validates_notify_copies_against_their_rows ... ok
2026-07-30T11:56:10.0324884Z test api::reporting::tests::filedrops_are_fixed_named_files ... ok
2026-07-30T11:56:10.1491842Z test api::delivery::tests::poll_drains_non_deferred_by_default ... ok
2026-07-30T11:56:10.2567126Z test api::delivery::tests::poll_only_drains_when_hook_method_present ... ok
2026-07-30T11:56:10.3916265Z test api::engineroom::tests::a_non_engine_room_attempt_never_touches_the_empower_ledger ... ok
2026-07-30T11:56:10.5038581Z test api::reporting::tests::boundary_appends_to_the_session_ledger ... ok
2026-07-30T11:56:10.7078870Z test api::reporting::tests::boundary_missing_perch_refused ... ok
2026-07-30T11:56:10.7134719Z test api::reporting::tests::boundary_injects_deferred_shell_context ... ok
2026-07-30T11:56:10.7921379Z test api::reporting::tests::boundary_rebinds_keeping_anchor ... ok
2026-07-30T11:56:10.8097983Z test api::reporting::tests::boundary_refuses_rotating_onto_a_psyche_custody_sid ... ok
2026-07-30T11:56:11.0524910Z test api::reporting::tests::boundary_resurfaces_undismissed_notifs ... ok
2026-07-30T11:56:11.0638389Z test api::startup::tests::a_dead_binder_pid_proves_nothing_and_never_drops_the_stamp ... ok
2026-07-30T11:56:11.0639864Z test api::startup::tests::a_dead_relays_capability_stamp_is_not_resurrected_by_a_listener_rebind ... ok
2026-07-30T11:56:11.1401831Z test api::reporting::tests::boundary_with_a_fresh_sid_is_unaffected_by_the_squat_guard ... ok
2026-07-30T11:56:11.1529556Z test api::reporting::tests::digest_entry_validates_and_appends_to_digest_log ... ok
2026-07-30T11:56:11.1733809Z test api::reporting::tests::driven_by_reads_daemon_marker ... ok
2026-07-30T11:56:11.2039602Z test api::reporting::tests::endpoint_info_activity_word_tracks_the_idle_sentinel ... ok
2026-07-30T11:56:11.2238535Z test api::reporting::tests::endpoint_info_reports_and_refuses ... ok
2026-07-30T11:56:11.2824606Z test api::reporting::tests::erase_unregisters_regardless_of_liveness ... ok
2026-07-30T11:56:11.2961669Z test api::reporting::tests::hint_once_per_session_one_per_message ... ok
2026-07-30T11:56:11.3145838Z test api::reporting::tests::history_log_appends ... ok
2026-07-30T11:56:11.3194494Z test api::reporting::tests::presence_records_endpoint ... ok
2026-07-30T11:56:11.4339534Z test api::reporting::tests::session_end_erase_reaps_stale_worker_then_proceeds ... ok
2026-07-30T11:56:11.5239300Z test api::reporting::tests::session_end_erase_refused_with_live_children ... ok
2026-07-30T11:56:11.5594957Z test api::reporting::tests::session_end_erase_wipes_childless_perch ... ok
2026-07-30T11:56:11.5595952Z test api::startup::tests::fresh_bind_over_dead_life_needs_both_terminal_and_a_new_session ... ok
2026-07-30T11:56:11.6038297Z test api::reporting::tests::session_end_soft_preserves_state ... ok
2026-07-30T11:56:11.6519676Z test api::reporting::tests::soft_end_preserves_a_live_listeners_address ... ok
2026-07-30T11:56:11.6520497Z test api::startup::tests::listen_never_asserts_hosting_topology_and_bind_still_does ... ok
2026-07-30T11:56:11.6521819Z test api::startup::tests::listen_online_gate_refuses_capability_only_online ... ok
2026-07-30T11:56:11.6523146Z test api::startup::tests::listen_orphan_exit_line_names_self_and_parent ... ok
2026-07-30T11:56:11.7115251Z test api::reporting::tests::soft_end_still_cleans_a_dead_listeners_address ... ok
2026-07-30T11:56:11.9422010Z test api::startup::tests::a_listener_over_a_dead_pty_is_not_offlined_by_the_liveness_reconcile ... ok
2026-07-30T11:56:12.0135790Z test api::startup::tests::bind_assigns_home_and_revive_preserves_it ... ok
2026-07-30T11:56:12.0712440Z test api::startup::tests::bind_gateway_earns_no_online_stamp ... ok
2026-07-30T11:56:12.0801393Z test api::startup::tests::parent_watchdog_triggers_exit_on_a_dead_parent_only ... ok
2026-07-30T11:56:12.7936175Z test api::startup::tests::bind_listen_control_detach_keeps_the_earned_hosting_authority ... ok
2026-07-30T11:56:12.7938958Z test api::startup::tests::read_env_measured_capture_replaces_prior_stamp ... ok
2026-07-30T11:56:12.8836609Z test api::startup::tests::bind_live_agent_over_prior_ready_agent_earns_online_on_controllable_with_preserved_type ... ok
2026-07-30T11:56:13.0033945Z test api::startup::tests::bind_records_cwd_so_picker_can_group_by_project ... ok
2026-07-30T11:56:13.0131728Z test api::startup::tests::bind_refuses_a_session_id_that_squats_a_psyche_custody_sid ... ok
2026-07-30T11:56:13.1109228Z test api::startup::tests::bind_with_type_establishes_a_gateway_endpoint ... ok
2026-07-30T11:56:13.1110365Z test api::startup::tests::seed_fail_eof_gives_actionable_stale_broker_hint ... ok
2026-07-30T11:56:13.1111641Z test api::startup::tests::seed_restorable_spends_dead_seeds_restores_recoverable ... ok
2026-07-30T11:56:13.1294578Z test api::startup::tests::bind_with_unrelated_sid_is_unaffected_by_the_squat_guard ... ok
2026-07-30T11:56:13.1341650Z test api::startup::tests::empty_session_seed_refusal_spends_the_seed_no_restore ... ok
2026-07-30T11:56:13.1402645Z test api::startup::tests::empty_session_seed_refused ... ok
2026-07-30T11:56:13.2578361Z test api::startup::tests::establish_stamps_controllable_by_hosting_mode ... ok
2026-07-30T11:56:13.3657406Z test api::startup::tests::fresh_create_over_a_stopped_life_reads_active_with_no_wake ... ok
2026-07-30T11:56:13.4417295Z test api::startup::tests::fresh_create_with_no_prior_carries_no_rest_state ... ok
2026-07-30T11:56:13.4417917Z test api::startup::tests::the_pid_role_is_stamped_from_the_entry_path ... ok
2026-07-30T11:56:13.4607903Z test api::startup::tests::live_perch_under_other_session_conflicts ... ok
2026-07-30T11:56:13.4627125Z test api::tests::adapter_is_optional ... ok
2026-07-30T11:56:13.4651642Z test api::startup::tests::missing_seed_refused ... ok
2026-07-30T11:56:13.4858800Z test api::startup::tests::no_seed_is_the_fallback_trigger_then_sid_binds ... ok
2026-07-30T11:56:13.5704650Z test api::startup::tests::post_spawn_bind_establishes_perch ... ok
2026-07-30T11:56:13.6005543Z test api::startup::tests::prebind_refusal_restores_the_seed_for_retry ... ok
2026-07-30T11:56:13.6015269Z test api::tests::state_value_is_validated ... ok
2026-07-30T11:56:13.6095597Z test api::tests::surface_parses ... ok
2026-07-30T11:56:13.6826453Z test api::startup::tests::rebind_same_session_ok ... ok
2026-07-30T11:56:13.7800126Z test api::startup::tests::revive_preserves_prior_rest_state_and_dormant_anchor ... ok
2026-07-30T11:56:13.8696990Z test api::startup::tests::revive_without_cwd_preserves_prior_cwd ... ok
2026-07-30T11:56:13.8916269Z test api::startup::tests::seed_bind_records_seed_captured_cwd ... ok
2026-07-30T11:56:13.8988368Z test api::startup::tests::session_id_fallback_binds_live_perch_from_sid ... ok
2026-07-30T11:56:13.9111266Z test api::startup::tests::session_id_fallback_refuses_empty_sid_and_dead_anchor ... ok
2026-07-30T11:56:13.9117230Z test api::startup::tests::session_id_fallback_refuses_a_psyche_custody_sid ... ok
2026-07-30T11:56:13.9125551Z test cli::resume_resolution_tests::resume_never_feeds_a_provisional ... ok
2026-07-30T11:56:13.9126865Z test cli::run_home_tests::order_by_mru_orders_guidance ... ok
2026-07-30T11:56:13.9128467Z test cli::run_home_tests::run_home_resolution_matrix ... ok
2026-07-30T11:56:13.9129863Z test cli::run_on_live_tests::run_on_live_never_duplicates_and_create_conflicts ... ok
2026-07-30T11:56:13.9131172Z test cli::run_target_tests::resolve_run_target_quadrants ... ok
2026-07-30T11:56:13.9179937Z test api::startup::tests::stale_seed_refusal_spends_the_seed_no_restore ... ok
2026-07-30T11:56:13.9181827Z test cli::tests::a_status_row_reads_held_over_running_and_carries_its_evidence ... ok
2026-07-30T11:56:13.9245186Z test cli::tests::access_subcommands_parse ... ok
2026-07-30T11:56:13.9247619Z test api::startup::tests::stale_seed_with_dead_anchor_refused ... ok
2026-07-30T11:56:13.9284380Z test cli::tests::adapter_add_transport_flags_parse ... ok
2026-07-30T11:56:13.9512927Z test api::startup::tests::successful_bind_consumes_the_seed_exactly_once ... ok
2026-07-30T11:56:13.9617499Z test cli::tests::a_local_hit_never_asks_the_broker ... ok
2026-07-30T11:56:13.9693567Z test api::startup::tests::valid_seed_binds_live_perch ... ok
2026-07-30T11:56:13.9695386Z test cli::tests::adapter_name_validation_flags_every_unknown ... ok
2026-07-30T11:56:13.9697312Z test cli::tests::adapter_names_comma_list_parses_and_refuses_empties ... ok
2026-07-30T11:56:13.9751634Z test api::tests::ctx_manifest_override_wins_when_manifest_present ... ok
2026-07-30T11:56:13.9856794Z test api::tests::ctx_manifest_unregistered_no_manifest_is_none_not_fatal ... ok
2026-07-30T11:56:13.9863920Z test api::tests::ctx_manifest_resolves_from_registry_when_manifest_absent ... ok
2026-07-30T11:56:13.9891941Z test api::tests::load_manifest_resolves_composite_adapter_option ... ok
2026-07-30T11:56:13.9931135Z test cli::tests::adapter_translate_proof_parses ... ok
2026-07-30T11:56:13.9932733Z test cli::tests::adapter_update_install_dir_is_registered_source_dir_not_repo_name ... ok
2026-07-30T11:56:13.9936556Z test cli::tests::adapter_update_notice_absent_when_no_message ... ok
2026-07-30T11:56:13.9940688Z test cli::tests::adapter_update_notice_renders_declared_message_markdown ... ok
2026-07-30T11:56:13.9942456Z test cli::tests::adapter_update_summary_and_exit_aggregate_isolated_failures ... ok
2026-07-30T11:56:13.9965043Z test cli::tests::adapter_subcommands_parse ... ok
2026-07-30T11:56:13.9978709Z test cli::tests::adapter_version_parses ... ok
2026-07-30T11:56:14.0219553Z test api::worker::tests::cascade_guard_tracks_live_children ... ok
2026-07-30T11:56:14.0221483Z test cli::tests::all_hidden_this_node_suppresses_no_perches_marker ... ok
2026-07-30T11:56:14.0223148Z test cli::tests::already_applied_message_reads_up_to_date_no_restart ... ok
2026-07-30T11:56:14.0651080Z test api::worker::tests::guard_clears_only_when_all_children_stopped ... ok
2026-07-30T11:56:14.0652707Z test cli::tests::any_single_evidence_source_is_enough_and_only_nothing_refuses ... ok
2026-07-30T11:56:14.0680233Z test cli::tests::api_adapter_flag_is_group_level_not_post_subcommand ... ok
2026-07-30T11:56:14.0701964Z test cli::tests::api_listen_accepts_session_id_flag ... ok
2026-07-30T11:56:14.0703665Z test cli::tests::applied_message_appends_restart_required_notice ... ok
2026-07-30T11:56:14.0705368Z test cli::tests::applied_message_renders_semver_or_counter_fallback_and_states_applied ... ok
2026-07-30T11:56:14.2431994Z test api::worker::tests::worker_poll_drains_spool ... ok
2026-07-30T11:56:14.3552534Z test cli::tests::apply_release_crc_swap_only_swaps_changed ... ok
2026-07-30T11:56:14.3580710Z test cli::tests::bare_spt_parses_to_none ... ok
2026-07-30T11:56:14.3582169Z test cli::tests::bare_tty_guard ... ok
2026-07-30T11:56:14.3632136Z test cli::tests::bare_update_parses_composite_flags ... ok
2026-07-30T11:56:14.3634055Z test cli::tests::broker_image_line_reports_without_warning_or_remedy ... ok
2026-07-30T11:56:14.3635604Z test cli::tests::classify_fetch_reject_matrix ... ok
2026-07-30T11:56:14.3636786Z test cli::tests::classify_flat_archive_never_misfires ... ok
2026-07-30T11:56:14.3638376Z test cli::tests::classify_multiplatform_captures_only_known_triples ... ok
2026-07-30T11:56:14.3639796Z test cli::tests::cli_send_stamps_cli_at_node_origin ... ok
2026-07-30T11:56:14.3641270Z test cli::tests::composite_plans_core_first_and_core_only_skips_adapters ... ok
2026-07-30T11:56:14.3642695Z test cli::tests::connection_lines_net_less_hides_stale_heartbeat ... ok
2026-07-30T11:56:14.3644460Z test cli::tests::coordinator_image_line_is_the_only_stale_warning ... ok
2026-07-30T11:56:14.3648253Z test cli::tests::create_existing_name_is_usage_error ... ok
2026-07-30T11:56:14.3654133Z test cli::tests::create_mints_two_distinct_keys_and_records_the_mode ... ok
2026-07-30T11:56:14.3655601Z test cli::tests::create_mode_is_never_preselected ... ok
2026-07-30T11:56:14.3659221Z test cli::tests::create_new_existing_name_is_usage_error ... ok
2026-07-30T11:56:14.3786027Z test cli::tests::create_new_mints_shows_and_requests_save ... ok
2026-07-30T11:56:14.3789874Z test cli::tests::create_not_elevated_refuses_without_saving ... ok
2026-07-30T11:56:14.4093222Z test cli::tests::create_prints_joining_material_when_elevated ... ok
2026-07-30T11:56:14.4442917Z test cli::tests::create_provisions_the_admin_key_and_show_code_never_does ... ok
2026-07-30T11:56:14.4444969Z test cli::tests::cross_node_after_filters_a_sealed_turn_exactly_like_the_local_path ... ok
2026-07-30T11:56:14.4446539Z test cli::tests::daemon_offline_hint_only_when_down ... ok
2026-07-30T11:56:14.4468392Z test cli::tests::daemon_refresh_verb_parses ... ok
2026-07-30T11:56:14.4549333Z test cli::tests::daemon_subcommands_parse ... ok
2026-07-30T11:56:14.4551512Z test cli::tests::daemonless_apply_message_points_at_finish_or_start ... ok
2026-07-30T11:56:14.4552950Z test cli::tests::deferred_elevation_gate_matrix ... ok
2026-07-30T11:56:14.4566053Z test cli::tests::digest_cursor_flags_parse ... ok
2026-07-30T11:56:14.4578987Z test cli::tests::digest_flag_defaults ... ok
2026-07-30T11:56:14.4580717Z test cli::tests::digest_human_path_keeps_the_stderr_trailer ... ok
2026-07-30T11:56:14.4583119Z test cli::tests::digest_json_carries_version_and_leaves_stderr_clean ... ok
2026-07-30T11:56:14.4585610Z test cli::tests::digest_json_predates_path_still_carries_version ... ok
2026-07-30T11:56:14.4587158Z test cli::tests::empty_store_no_flag_guides_to_pair_or_create ... ok
2026-07-30T11:56:14.8254838Z test api::worker::tests::worker_poll_holds_deferred_while_resting ... ok
2026-07-30T11:56:14.8287198Z test cli::tests::endpoint_role_parses ... ok
2026-07-30T11:56:14.8289152Z test cli::tests::endpoint_row_json_endpoint_type_is_additive ... ok
2026-07-30T11:56:14.8694216Z test api::worker::tests::worker_start_mints_id_stores_parent_sid_and_metadata ... ok
2026-07-30T11:56:14.8826968Z test cli::tests::endpoint_subcommands_parse ... ok
2026-07-30T11:56:14.8828261Z test cli::tests::engine_room_purge_resets_under_elevation_and_refuses_without_it ... ok
2026-07-30T11:56:14.8829578Z test cli::tests::escalation_choice_parses_fail_closed ... ok
2026-07-30T11:56:14.8927482Z test api::worker::tests::worker_start_nests_under_parent ... ok
2026-07-30T11:56:14.8930738Z test cli::tests::every_read_status_command_emits_valid_json ... ok
2026-07-30T11:56:14.9334174Z test api::worker::tests::worker_start_registration_sid_falls_back_to_presented ... ok
2026-07-30T11:56:14.9651881Z test cli::tests::extract_legacy_flat_stays_flat ... ok
2026-07-30T11:56:14.9653168Z test cli::tests::fetch_reject_action_apply_decision ... ok
2026-07-30T11:56:14.9654608Z test cli::tests::filter_after_excludes_at_or_below_cursor ... ok
2026-07-30T11:56:14.9656732Z test cli::tests::filter_after_predates_window_returns_full ... ok
2026-07-30T11:56:14.9658537Z test cli::tests::finish_message_states_fully_live_no_manual_restart ... ok
2026-07-30T11:56:14.9681002Z test cli::tests::extract_multiplatform_missing_my_triple_is_typed_rejection ... ok
2026-07-30T11:56:14.9682468Z test cli::tests::gh_download_command_no_tag_omits_tag ... ok
2026-07-30T11:56:14.9683855Z test cli::tests::gh_download_command_with_tag_shape ... ok
2026-07-30T11:56:14.9685325Z test cli::tests::gh_failure_classes_render_os_correct_hints ... ok
2026-07-30T11:56:14.9687584Z test cli::tests::gh_release_version_compare_decision ... ok
2026-07-30T11:56:14.9688909Z test cli::tests::gh_version_command_shape ... ok
2026-07-30T11:56:14.9736929Z test cli::tests::grant_subcommands_parse ... ok
2026-07-30T11:56:14.9777366Z test cli::tests::help_groups_cover_every_command ... ok
2026-07-30T11:56:14.9888797Z test cli::tests::hot_path_flat_and_moved_verbs_gone ... ok
2026-07-30T11:56:14.9919805Z test cli::tests::how_to_topics_cover_ready_and_send ... ok
2026-07-30T11:56:15.0017876Z test cli::tests::install_place_is_idempotent_and_path_block_detected ... ok
2026-07-30T11:56:15.0019141Z test cli::tests::install_platform_check_gates_stamp_and_host_arch ... ok
2026-07-30T11:56:15.0022004Z test cli::tests::instance_rows_palette_and_align ... ok
2026-07-30T11:56:15.0024585Z test cli::tests::instance_rows_project_column ... ok
2026-07-30T11:56:15.0049160Z test cli::tests::invalid_usage_errors ... ok
2026-07-30T11:56:15.0050665Z test cli::tests::join_gate_refuses_without_confirmed_elevation ... ok
2026-07-30T11:56:15.0052791Z test cli::tests::json_activity_key_is_local_only_and_skips_when_unknown ... ok
2026-07-30T11:56:15.0064593Z test cli::tests::json_activity_words_come_from_the_shared_vocabulary_source ... ok
2026-07-30T11:56:15.0090269Z test cli::tests::extract_multiplatform_places_shared_root_and_flattens_my_triple ... ok
2026-07-30T11:56:15.0091567Z test cli::tests::json_project_field_skip_if_none ... ok
2026-07-30T11:56:15.0207838Z test cli::tests::multi_subnet_refuses_without_flag_then_resolves_with_it ... ok
2026-07-30T11:56:15.0210214Z test cli::tests::node_group_discards_self_and_skips_empty ... ok
2026-07-30T11:56:15.0212298Z test cli::tests::node_group_freshest_epoch_wins_and_unions_subnets ... ok
2026-07-30T11:56:15.0214138Z test cli::tests::node_group_same_id_two_nodes_two_groups ... ok
2026-07-30T11:56:15.0216223Z test cli::tests::node_grouped_render_structure_and_palette ... ok
2026-07-30T11:56:15.0218760Z test cli::tests::node_level_label_names_an_endpointless_peer ... ok
2026-07-30T11:56:15.0220756Z test cli::tests::node_rows_disambiguate_only_on_label_collision ... ok
2026-07-30T11:56:15.0222508Z test cli::tests::node_status_rows_denominator_counts_routable_only ... ok
2026-07-30T11:56:15.0224601Z test cli::tests::node_status_rows_settle_cheap_signals_probe_only_stale ... ok
2026-07-30T11:56:15.0229548Z test cli::tests::not_elevated_refuses_without_leaking_code_or_saving ... ok
2026-07-30T11:56:15.0235183Z test cli::tests::notify_subnet_resolution_home_default ... ok
2026-07-30T11:56:15.0283633Z test cli::tests::notify_surface_parses ... ok
2026-07-30T11:56:15.0285086Z test cli::tests::origin_asset_urls_latest_and_tag ... ok
2026-07-30T11:56:15.0510484Z test cli::tests::adapter_digest_proof_fills_session_id_key ... ok
2026-07-30T11:56:15.0531786Z test cli::tests::pair_namespace_is_gone ... ok
2026-07-30T11:56:15.0533854Z test cli::tests::peer_health_line_names_the_stage_and_stays_silent_when_idle ... ok
2026-07-30T11:56:15.0535220Z test cli::tests::poll_until_ready_fastpath_timeout_and_later_success ... ok
2026-07-30T11:56:15.0536298Z test cli::tests::post_step_notice_arbitration ... ok
2026-07-30T11:56:15.0560201Z test cli::tests::probe_all_cap_batches_into_windows ... ok
2026-07-30T11:56:15.2571987Z test cli::tests::probe_all_runs_concurrently_in_input_order ... ok
2026-07-30T11:56:15.2943647Z test cli::tests::adapter_digest_proof_gates_on_drops ... ok
2026-07-30T11:56:15.2945041Z test cli::tests::project_index_line_states_health_not_presence ... ok
2026-07-30T11:56:15.2946637Z test cli::tests::prune_candidates_resolve_never_guess ... ok
2026-07-30T11:56:15.3163037Z test cli::tests::adapter_has_live_endpoint_detects_matching_live_perch ... ok
2026-07-30T11:56:15.3690934Z test cli::tests::adapter_has_live_endpoint_false_for_other_or_dead ... ok
2026-07-30T11:56:15.3920743Z test cli::tests::adapter_profile_verbs_local_only ... ok
2026-07-30T11:56:15.4070347Z test cli::tests::registered_github_home_detects_active_collision ... ok
2026-07-30T11:56:15.4146772Z test cli::tests::probe_all_timeout_settles_false_without_stalling_batch ... ok
2026-07-30T11:56:15.4148458Z test cli::tests::remote_cell_project_ref_from_gossiped_recent_projects ... ok
2026-07-30T11:56:15.4152477Z test cli::tests::adapter_string_verbs ... ok
2026-07-30T11:56:15.4153753Z test cli::tests::resolve_transport_auto_follows_probe ... ok
2026-07-30T11:56:15.4154923Z test cli::tests::resolve_transport_explicit_never_probes ... ok
2026-07-30T11:56:15.4156432Z test cli::tests::rest_filter_hides_suspended_shows_all_and_corrupt_always ... ok
2026-07-30T11:56:15.4157909Z test cli::tests::rest_filter_status_first_ordering ... ok
2026-07-30T11:56:15.4159571Z test cli::tests::rest_filter_total_disclosure_and_corrupt_annotation ... ok
2026-07-30T11:56:15.4160813Z test cli::tests::restart_plans_lethal_leg_last ... ok
2026-07-30T11:56:15.4177139Z test cli::tests::ring_timeout_defaults ... ok
2026-07-30T11:56:15.4775416Z test cli::tests::run_bounded_yields_value_or_timeout_default ... ok
2026-07-30T11:56:15.4777259Z test cli::tests::self_pin_annotates_psyche_host_failure ... ok
2026-07-30T11:56:15.4778884Z test cli::tests::self_pin_annotates_translation_fault ... ok
2026-07-30T11:56:15.4780774Z test cli::tests::self_pin_includes_description_when_present ... ok
2026-07-30T11:56:15.4813791Z test cli::tests::send_reply_to_flag_is_removed_and_target_required ... ok
2026-07-30T11:56:15.4833875Z test cli::tests::send_user_msg_flag_parses ... ok
2026-07-30T11:56:15.5261717Z test cli::tests::release_archive_extracts_to_a_registrable_root ... ok
2026-07-30T11:56:20.5525970Z test cli::tests::adapter_translate_proof_gates_on_commit ... ok
2026-07-30T11:56:20.5765861Z test cli::tests::adapter_use_sets_and_clears_pointer ... ok
2026-07-30T11:56:20.5892388Z test cli::tests::adapter_version_surfaces_declared_adapter_version ... ok
2026-07-30T11:56:21.5426552Z test cli::tests::an_engine_room_reset_wipes_records_but_never_deletes_the_engine_room ... ok
2026-07-30T11:56:21.5607291Z test cli::tests::apply_user_msg_gate_local_origination ... ok
2026-07-30T11:56:25.0151638Z test cli::tests::endpoint_role_overwrite_is_the_sole_writer ... ok
2026-07-30T11:56:25.0248507Z test cli::tests::shell_subcommands_parse ... ok
2026-07-30T11:56:25.0352495Z test cli::tests::show_code_prints_reprovisioning_material ... ok
2026-07-30T11:56:25.1119856Z test cli::tests::endpoint_stop_marks_offline ... ok
2026-07-30T11:56:28.0309808Z test cli::tests::json_payload_rides_as_attr_alongside_body ... ok
2026-07-30T11:56:28.0557520Z test cli::tests::fork_forks_homes_and_deletes_exactly_the_source ... ok
2026-07-30T11:56:28.0677210Z test cli::tests::single_subnet_auto_selects_and_code_matches_seed ... ok
2026-07-30T11:56:44.7119278Z test cli::tests::owner_shutdown_gated_by_can_shutdown_grant ... ok
2026-07-30T11:56:44.9518056Z test cli::tests::stage_then_swap_failed_fetch_preserves_install ... ok
2026-07-30T11:56:45.0067304Z test cli::tests::staged_floor_admits_when_core_meets_floor ... ok
2026-07-30T11:56:45.0613000Z test cli::tests::staged_floor_refuses_above_floor_and_leaves_dest_untouched ... ok
2026-07-30T11:56:45.0614379Z test cli::tests::stall_evict_line_surfaces_only_a_real_tally ... ok
2026-07-30T11:56:45.0615662Z test cli::tests::stop_guard_refuses_live_sessions_without_force ... ok
2026-07-30T11:56:45.0711128Z test cli::tests::subcommands_parse ... ok
2026-07-30T11:56:45.0884504Z test cli::tests::subnet_arg_shapes_parse ... ok
2026-07-30T11:56:45.0889530Z test cli::tests::subnet_status_renders_rows_and_hints_never_secrets ... ok
2026-07-30T11:56:45.0891455Z test cli::tests::subnets_joined_banner_renders_rows_and_divider ... ok
2026-07-30T11:56:45.0893155Z test cli::tests::subprocess_detail_prefers_stderr_then_stdout ... ok
2026-07-30T11:56:45.1458364Z test cli::tests::the_evidence_census_reads_each_local_source ... ok
2026-07-30T11:56:45.1460437Z test cli::tests::this_node_group_merges_roster_with_unbound_truth ... ok
2026-07-30T11:56:45.1461680Z test cli::tests::trust_mutation_gate_refuses_without_confirmed_elevation ... ok
2026-07-30T11:56:45.1465822Z test cli::tests::unknown_elevation_falls_back ... ok
2026-07-30T11:56:45.1471133Z test cli::tests::unknown_named_subnet_is_usage_error ... ok
2026-07-30T11:56:45.1495853Z test cli::tests::update_adapters_verb_parses_with_optional_names ... ok
2026-07-30T11:56:45.1516002Z test cli::tests::update_fetch_apply_flag_parses ... ok
2026-07-30T11:56:45.1535772Z test cli::tests::whoami_parses_as_the_identity_verb ... ok
2026-07-30T11:56:45.1537366Z test elevation::tests::already_elevated_short_circuits_on_every_os ... ok
2026-07-30T11:56:45.1538715Z test elevation::tests::current_returns_a_determinate_level_on_supported_platforms ... ok
2026-07-30T11:56:45.1540105Z test elevation::tests::fallback_message_names_authenticator_app_and_subnet ... ok
2026-07-30T11:56:45.1541211Z test elevation::tests::gate_shows_only_when_confirmed_elevated ... ok
2026-07-30T11:56:45.1542580Z test elevation::tests::launcher_argv_is_absolute_exe_plus_verbatim_args ... ok
2026-07-30T11:56:45.1544179Z test elevation::tests::launchers_never_shell_interpolate_a_crafted_arg ... ok
2026-07-30T11:56:45.1545798Z test elevation::tests::print_hint_floor_uses_absolute_path_each_os ... ok
2026-07-30T11:56:45.1547047Z test elevation::tests::unix_path_order_tty_then_pkexec_then_terminal_then_hint ... ok
2026-07-30T11:56:45.1548044Z test elevation::tests::windows_uac_only_interactive_other_always_prints ... ok
2026-07-30T11:56:45.1549521Z test helpfmt::tests::atx_header_at_line_start_strips_and_bolds ... ok
2026-07-30T11:56:45.1550725Z test helpfmt::tests::bold_styles_with_color_and_strips_without ... ok
2026-07-30T11:56:45.1551671Z test helpfmt::tests::code_styles_with_color_and_strips_without ... ok
2026-07-30T11:56:45.1552729Z test helpfmt::tests::color_enabled_truth_table ... ok
2026-07-30T11:56:45.1553868Z test helpfmt::tests::dual_contract_token_survives_strip_mode ... ok
2026-07-30T11:56:45.1555205Z test helpfmt::tests::dual_contract_token_unstyled_while_prose_styles_on_color ... ok
2026-07-30T11:56:45.1556399Z test helpfmt::tests::empty_and_unmatched_markers_stay_literal ... ok
2026-07-30T11:56:45.1557585Z test helpfmt::tests::link_becomes_its_text ... ok
2026-07-30T11:56:45.1559056Z test helpfmt::tests::marker_never_spans_a_hard_break ... ok
2026-07-30T11:56:45.1560302Z test helpfmt::tests::marker_spans_a_clap_soft_wrap ... ok
2026-07-30T11:56:45.1561618Z test helpfmt::tests::multibyte_text_survives ... ok
2026-07-30T11:56:45.1562890Z test helpfmt::tests::nested_code_inside_bold_styles_both ... ok
2026-07-30T11:56:45.1564099Z test helpfmt::tests::plain_text_is_unchanged ... ok
2026-07-30T11:56:45.1565469Z test helpfmt::tests::preexisting_ansi_is_passed_through_untouched ... ok
2026-07-30T11:56:45.1566910Z test helpfmt::tests::resolve_console_color_strips_when_vt_unavailable ... ok
2026-07-30T11:56:45.1568995Z test picker::data::tests::disambiguate_project_ids_cases ... ok
2026-07-30T11:56:45.1570507Z test picker::data::tests::driven_by_display_renders_name_not_hex ... ok
2026-07-30T11:56:45.2228003Z test cli::tests::purge_force_asks_before_it_tears_anything_down ... ok
2026-07-30T11:56:45.2431524Z test cli::tests::purge_offline_gate_and_self_guard ... ok
2026-07-30T11:56:47.2627249Z test cli::tests::resolve_proof_target_override_reads_on_disk ... ok
2026-07-30T11:56:47.2629947Z test picker::data::tests::indexed_projection_full_w2shaped_and_absent_legs ... ok
2026-07-30T11:56:47.2630509Z test picker::data::tests::non_drivable_predicate_covers_worker_and_psyche ... ok
2026-07-30T11:56:47.2682503Z test cli::tests::purge_removes_every_record ... ok
2026-07-30T11:56:47.5544613Z test cli::tests::shell_channels_relay_sensory_and_text_file ... ok
2026-07-30T11:56:47.5546293Z test picker::data::tests::project_refs_from_sessions_excludes_owlery_and_dedups_newest_first ... ok
2026-07-30T11:56:47.5547692Z test picker::data::tests::project_refs_from_unions_fresh_origin_and_store_branches ... ok
2026-07-30T11:56:47.5549211Z test picker::data::tests::reconcile_overrides_subnet_with_local_roster ... ok
2026-07-30T11:56:47.6013940Z test cli::tests::shell_owner_exclusivity_negatives ... ok
2026-07-30T11:56:47.8054331Z test cli::tests::shell_relink_relaunches_offline_instances_only ... ok
2026-07-30T11:56:47.8056062Z test picker::data::tests::resume_rows_derive_per_row_project_and_drop_owlery_sessions ... ok
2026-07-30T11:56:47.9849535Z test cli::tests::shell_spawn_approval_floor_gates ... ok
2026-07-30T11:56:47.9850526Z test picker::data::tests::row_status_drives_unbound_display ... ok
2026-07-30T11:56:48.2240061Z test cli::tests::shell_spawn_cap_and_over_cap_gates ... ok
2026-07-30T11:56:48.2241663Z test picker::model::tests::adapter_tree_nests_profiles ... ok
2026-07-30T11:56:48.2243062Z test picker::model::tests::back_unwinds ... ok
2026-07-30T11:56:48.2244741Z test picker::model::tests::build_project_choices_head_here_rest ... ok
2026-07-30T11:56:48.2246291Z test picker::model::tests::category_labels_render_display_forms ... ok
2026-07-30T11:56:48.2247631Z test picker::model::tests::category_ring_wraps ... ok
2026-07-30T11:56:48.2249901Z test picker::model::tests::change_adapter_picks_and_returns_to_confirm ... ok
2026-07-30T11:56:48.2251890Z test picker::model::tests::choose_project_outcome_bakes_cwd_and_diverts ... ok
2026-07-30T11:56:48.2253777Z test picker::model::tests::confirm_local_offline_unchanged_by_wake_split ... ok
2026-07-30T11:56:48.2255188Z test picker::model::tests::confirm_options_remote_suspended_is_wake_not_start ... ok
2026-07-30T11:56:48.2256950Z test picker::model::tests::confirm_options_status_dependent ... ok
2026-07-30T11:56:48.2258689Z test picker::model::tests::confirm_terminal_routes ... ok
2026-07-30T11:56:48.2260393Z test picker::model::tests::confirm_terminal_wake_carries_raw_node ... ok
2026-07-30T11:56:48.2261893Z test picker::model::tests::create_new_multisubnet_inserts_home_layer ... ok
2026-07-30T11:56:48.2263610Z test picker::model::tests::create_outcome_bakes_run ... ok
2026-07-30T11:56:48.2264825Z test picker::model::tests::cursor_clamps ... ok
2026-07-30T11:56:48.2266090Z test picker::model::tests::display_mapping_matrix ... ok
2026-07-30T11:56:48.2267472Z test picker::model::tests::display_status_four_state_type_gated ... ok
2026-07-30T11:56:48.2268844Z test picker::model::tests::display_status_unbound_is_hollow_and_attachable ... ok
2026-07-30T11:56:48.2270244Z test picker::model::tests::empty_scope_opens_create ... ok
2026-07-30T11:56:48.2271882Z test picker::model::tests::ep_display_glyph_and_square_palette ... ok
2026-07-30T11:56:48.2273409Z test picker::model::tests::esc_backs_out_of_home_layer ... ok
2026-07-30T11:56:48.2276296Z test picker::model::tests::filter_narrows ... ok
2026-07-30T11:56:48.2278218Z test picker::model::tests::from_resource_row_maps_gossiped_adapter_projects_controlled ... ok
2026-07-30T11:56:48.2279581Z test picker::model::tests::home_selection_bakes_into_run_subnet ... ok
2026-07-30T11:56:48.2281112Z test picker::model::tests::kind_routes ... ok
2026-07-30T11:56:48.2282991Z test picker::model::tests::launch_keys_live_only_on_launch_capable_highlights ... ok
2026-07-30T11:56:48.2284188Z test picker::model::tests::prefill_jumps_to_create ... ok
2026-07-30T11:56:48.2285715Z test picker::model::tests::project_filter_keys_on_slug_while_tab_renders_display ... ok
2026-07-30T11:56:48.2287528Z test picker::model::tests::purge_confirm_yields_outcome_and_backs_out ... ok
2026-07-30T11:56:48.2288585Z test picker::model::tests::purge_shortcut_gates_to_offline_local ... ok
2026-07-30T11:56:48.2290142Z test picker::model::tests::reenter_create_keeps_or_clears_id ... ok
2026-07-30T11:56:48.2291487Z test picker::model::tests::remove_endpoint_drops_row_and_clamps_cursor ... ok
2026-07-30T11:56:48.2292866Z test picker::model::tests::resume_outcome_adapter_follows_recorded_row ... ok
2026-07-30T11:56:48.2294333Z test picker::model::tests::resume_outcome_bakes_session ... ok
2026-07-30T11:56:48.2296898Z test picker::model::tests::resume_title_render ... ok
2026-07-30T11:56:48.2298251Z test picker::model::tests::should_offer_project_choice_fire_conditions ... ok
2026-07-30T11:56:48.2299715Z test picker::model::tests::single_subnet_skips_home_layer ... ok
2026-07-30T11:56:48.2301022Z test picker::model::tests::suspended_is_distinct_from_offline ... ok
2026-07-30T11:56:48.2302646Z test picker::model::tests::visible_partitions_and_sorts ... ok
2026-07-30T11:56:48.2304415Z test picker::shortcut::tests::bakes_create_attach_by_default ... ok
2026-07-30T11:56:48.2306015Z test picker::shortcut::tests::bakes_resume_and_action ... ok
2026-07-30T11:56:48.2307510Z test picker::shortcut::tests::basename_is_parameterized ... ok
2026-07-30T11:56:48.2309160Z test picker::shortcut::tests::sentinel_detection ... ok
2026-07-30T11:56:48.2563728Z test picker::shortcut::tests::write_create_update_refuse ... ok
2026-07-30T11:56:48.2565082Z test picker::tests::backspace_backs_out_screens_like_esc ... ok
2026-07-30T11:56:48.2566497Z test picker::tests::backspace_stays_char_delete_in_text_contexts ... ok
2026-07-30T11:56:48.2567741Z test picker::tests::purge_outcomes_convert_to_flash_lines ... ok
2026-07-30T11:56:48.2634464Z test picker::tests::purge_transition_reconstructs_the_complete_screen_after_external_mutation ... ok
2026-07-30T11:56:48.2668245Z test picker::view::tests::adapter_tree_buffer ... ok
2026-07-30T11:56:48.2696144Z test picker::view::tests::change_adapter_screen_renders_tree_and_apply_legend ... ok
2026-07-30T11:56:48.2735401Z test picker::view::tests::choose_project_buffer_keeps_confirm_panel ... ok
2026-07-30T11:56:48.2768656Z test picker::view::tests::confirm_buffer_options ... ok
2026-07-30T11:56:48.2801587Z test picker::view::tests::confirm_fork_and_shortcut_labels_are_dir_relative ... ok
2026-07-30T11:56:48.2830956Z test picker::view::tests::confirm_panel_history_renders_display_not_slug ... ok
2026-07-30T11:56:48.2854852Z test picker::view::tests::create_home_lists_subnets ... ok
2026-07-30T11:56:48.2916151Z test picker::view::tests::footer_hints_h_s_only_when_launch_keys_live ... ok
2026-07-30T11:56:48.2940676Z test picker::view::tests::kind_buffer ... ok
2026-07-30T11:56:48.2976243Z test picker::view::tests::pick_buffer_has_squares_and_description ... ok
2026-07-30T11:56:48.3009884Z test picker::view::tests::pick_empty_category_hint ... ok
2026-07-30T11:56:48.3277253Z test picker::view::tests::pick_status_line_four_state ... ok
2026-07-30T11:56:48.3321032Z test picker::view::tests::resume_buffer_keeps_confirm_panel ... ok
2026-07-30T11:56:48.3364633Z test picker::view::tests::resume_buffer_lists_sessions ... ok
2026-07-30T11:56:59.4917711Z test cli::tests::shell_spawn_gates_on_the_registered_set ... ok
2026-07-30T11:56:59.4918883Z test rc::tests::attach_gate_routes_on_session_truth_not_the_row ... ok
2026-07-30T11:56:59.5330077Z test cli::tests::shell_spawn_profiled_option_resolves_and_shares_cap ... ok
2026-07-30T11:56:59.6491831Z test cli::tests::shutdown_and_stop_share_the_postcondition_and_differ_only_in_ceremony ... ok
2026-07-30T11:56:59.6492936Z test rc::tests::bracketed_paste_framing_is_exact_and_content_verbatim ... ok
2026-07-30T11:56:59.6494502Z test rc::tests::broker_host_child ... ok
2026-07-30T11:56:59.6495854Z test rc::tests::canonical_wire_id_strips_qualifiers_to_the_bare_id ... ok
2026-07-30T11:56:59.6497228Z test rc::tests::classify_read_err_eof_is_graceful_not_fatal ... ok
2026-07-30T11:56:59.6498205Z test rc::tests::clipboard_paste_wraps_nonempty_and_noops_on_empty_or_failure ... ok
2026-07-30T11:56:59.6499588Z test rc::tests::detach_keybind_semantics ... ok
2026-07-30T11:56:59.6500934Z test rc::tests::detach_prefix_spans_chunks ... ok
2026-07-30T11:56:59.6502295Z test rc::tests::display_guard_postlude_exactly_once_and_inactive_silent ... ok
2026-07-30T11:56:59.6503540Z test rc::tests::driver_phrase_names_own_node_plainly_but_remote_verbatim ... ok
2026-07-30T11:56:59.7512131Z test cli::tests::shutdown_on_a_broker_hosted_endpoint_stamps_after_the_reap ... ok
2026-07-30T11:56:59.7512760Z test rc::tests::first_event_stall_decision ... ok
2026-07-30T11:56:59.7514420Z test rc::tests::give_up_copy_names_daemon_down_vs_generic ... ok
2026-07-30T11:56:59.7515841Z test rc::tests::harness_only_row_matches_online_seatless_live_agents_only ... ok
2026-07-30T11:56:59.7517024Z test rc::tests::identity_line_format ... ok
2026-07-30T11:56:59.7518590Z test rc::tests::key_event_step_detach_sm ... ok
2026-07-30T11:56:59.7519801Z test rc::tests::mouse_is_paste_only_right_button_down ... ok
2026-07-30T11:56:59.7521262Z test rc::tests::mouse_mode_decset_scan_survives_split_across_chunks ... ok
2026-07-30T11:56:59.7522321Z test rc::tests::mouse_mode_decset_scan_tracks_enable_and_sgr ... ok
2026-07-30T11:56:59.7525606Z test rc::tests::op_minter_distinct_and_monotonic ... ok
2026-07-30T11:56:59.7526705Z test rc::tests::pre_broker_busy_guidance_fires_for_any_driver_not_just_remote ... ok
2026-07-30T11:56:59.7527822Z test rc::tests::public_attach_failure_maps_deadline_class_only ... ok
2026-07-30T11:56:59.7529317Z test rc::tests::pump_status_emit_sequence_over_write_sink ... ok
2026-07-30T11:57:00.4226511Z test cli::tests::shutdown_on_a_harness_hosted_endpoint_claims_no_process ... ok
2026-07-30T11:57:00.4227740Z test rc::tests::reassert_scanner_survives_split_across_chunks ... ok
2026-07-30T11:57:00.4229298Z test rc::tests::reassert_scanner_triggers_only_on_region_destroyers ... ok
2026-07-30T11:57:00.4230967Z test rc::tests::reconnect_banner_clears_and_centers ... ok
2026-07-30T11:57:00.4232400Z test rc::tests::reconnect_banner_shows_the_countdown ... ok
2026-07-30T11:57:00.4234257Z test rc::tests::reconnect_class_only_severed_transport_redrives ... ok
2026-07-30T11:57:00.4236553Z test rc::tests::reconnect_remaining_secs_counts_down_ceil ... ok
2026-07-30T11:57:00.4237922Z test rc::tests::reconnect_window_expiry_decision ... ok
2026-07-30T11:57:00.4239610Z test rc::tests::scroll_dir_classifies_wheel_only ... ok
2026-07-30T11:57:00.4240936Z test rc::tests::scroll_sgr_emits_exact_xterm_bytes ... ok
2026-07-30T11:57:00.4242471Z test rc::tests::serve_eof_severed_vs_refused ... ok
2026-07-30T11:57:00.4243763Z test rc::tests::status_assert_reserves_row1_then_repaints ... ok
2026-07-30T11:57:00.4245068Z test rc::tests::status_repaint_exact_bytes_and_right_align ... ok
2026-07-30T11:57:00.4246268Z test rc::tests::status_restore_exact_bytes ... ok
2026-07-30T11:57:00.4247590Z test rc::tests::status_row_marker_is_disabled_by_flag ... ok
2026-07-30T11:57:00.4249028Z test rc::tests::status_update_size_repoints_geometry ... ok
2026-07-30T11:57:00.4250929Z test rc::tests::teardown_matrix_postlude_precedes_prose_across_every_final_class ... ok
2026-07-30T11:57:00.4252644Z test rc::tests::the_client_refuses_engine_room_viewports_and_qualified_targets_only ... ok
2026-07-30T11:57:00.4254201Z test rc::tests::translate_key_event_emits_exact_xterm_vt ... ok
2026-07-30T11:57:00.4255353Z test rc::tests::with_vt_output_disables_newline_auto_return ... ok
2026-07-30T11:57:00.4256426Z test rc::tests::with_vt_output_enables_virtual_terminal_processing ... ok
2026-07-30T11:57:01.4486275Z test cli::tests::spt_hosted_no_relay_detection ... ok
2026-07-30T11:57:01.5162294Z test picker::data::tests::gather_endpoints_projects_from_seeded_index_with_zero_git ... ok
2026-07-30T11:57:01.5836808Z test picker::data::tests::gather_renders_live_unbound ... ok
2026-07-30T11:57:01.7038013Z test picker::data::tests::home_subnet_options_is_mru_ordered ... ok
2026-07-30T11:57:01.7189858Z test picker::data::tests::own_node_tab_label_falls_back_to_keyprefix ... ok
2026-07-30T11:57:01.7845116Z test picker::data::tests::picker_excludes_flat_worker_and_psyche ... ok
2026-07-30T11:57:01.7980547Z test picker::data::tests::remote_picker_renders_suspended_dead_perch_offline ... ok
2026-07-30T11:57:01.7981548Z test roster::tests::match_self_by_ancestry_disambiguates_and_none ... ok
2026-07-30T11:57:01.8134966Z test picker::data::tests::remote_rows_render_full_palette_parity ... ok
2026-07-30T11:57:01.8136450Z test teardown::tests::an_unconfirmed_row_over_a_dead_root_is_stale_not_a_survivor ... ok
2026-07-30T11:57:01.8250243Z test picker::data::tests::resume_rows_title_from_index_cwd_map_with_pure_fallback ... ok
2026-07-30T11:57:01.8251780Z test teardown::tests::timeout_refuses_the_stamp_and_names_the_survivor ... ok
2026-07-30T11:57:01.8253140Z test teardown::tests::topology_gate_is_controllable_true_only ... ok
2026-07-30T11:57:01.8254691Z test tests::broken_pipe_panic_classifier ... ok
2026-07-30T11:57:01.8256489Z test wansend::tests::bare_id_resolves_across_remote_snapshot ... ok
2026-07-30T11:57:01.8257853Z test wansend::tests::classify_wan_reply_only_delivers_on_positive_outcomes ... ok
2026-07-30T11:57:01.8328851Z test wansend::tests::load_snapshots_degrades_on_junk ... ok
2026-07-30T11:57:01.8331197Z test wansend::tests::refusals_render_copy_paste_targets ... ok
2026-07-30T11:57:01.8384297Z test teardown::tests::liveness_proof_needs_a_real_snapshot_and_finds_this_process ... ok
2026-07-30T11:57:01.8425292Z test picker::data::tests::shared_machine_is_one_group_with_unioned_subnets ... ok
2026-07-30T11:57:01.8628239Z test rc::tests::attach_against_stopped_daemon_never_spawns_and_exits_loud ... ok
2026-07-30T11:57:01.8874047Z test rc::tests::attach_offline_endpoint_short_circuits_clean ... ok
2026-07-30T11:57:01.9034103Z 
2026-07-30T11:57:01.9034218Z running 1 test
2026-07-30T11:57:01.9388555Z NTP_TOTP_UNCORRECTED: all NTP servers unreachable — ceremony clock = raw system clock
2026-07-30T11:57:01.9485400Z CONN_LIFECYCLE: conn=1 role=brain wall_ms=1785412621948 mono_ms=0 event=transport-close poisoned=false timed_out=false [REQ-CONN-POISON-ATTRIBUTION]
2026-07-30T11:57:01.9487086Z CONN_LIFECYCLE: conn=3 role=brain wall_ms=1785412621948 mono_ms=0 event=write-start [REQ-CONN-POISON-ATTRIBUTION]
2026-07-30T11:57:02.0686252Z CONN_LIFECYCLE: conn=2 role=brain controller session=1 endpoint=reheal by=local wall_ms=1785412622068 mono_ms=120 event=controller-attach session=1 from_seq=0 [REQ-CONN-POISON-ATTRIBUTION]
2026-07-30T11:57:02.0690475Z CONN_LIFECYCLE: conn=2 role=brain controller session=1 endpoint=reheal by=local wall_ms=1785412622068 mono_ms=120 event=write-start [REQ-CONN-POISON-ATTRIBUTION]
2026-07-30T11:57:02.0697648Z CONN_LIFECYCLE: conn=4 role=brain wall_ms=1785412622069 mono_ms=121 event=write-start [REQ-CONN-POISON-ATTRIBUTION]
2026-07-30T11:57:02.0835449Z CONN_LIFECYCLE: conn=4 role=brain stream-subscriber stream=2 wall_ms=1785412622083 mono_ms=135 event=stream-sub-attach stream=2 from_seq=0 [REQ-CONN-POISON-ATTRIBUTION]
2026-07-30T11:57:02.0999396Z CONN_LIFECYCLE: conn=5 role=brain wall_ms=1785412622099 mono_ms=151 event=write-start [REQ-CONN-POISON-ATTRIBUTION]
2026-07-30T11:57:02.1000843Z CONN_LIFECYCLE: conn=5 role=brain wall_ms=1785412622099 mono_ms=151 event=transport-close poisoned=false timed_out=false [REQ-CONN-POISON-ATTRIBUTION]
2026-07-30T11:57:02.1003368Z CONN_LIFECYCLE: conn=6 role=brain wall_ms=1785412622100 mono_ms=151 event=write-start [REQ-CONN-POISON-ATTRIBUTION]
2026-07-30T11:57:02.1005358Z CONN_LIFECYCLE: conn=6 role=brain stream-subscriber stream=1 wall_ms=1785412622100 mono_ms=152 event=stream-sub-attach stream=1 from_seq=0 [REQ-CONN-POISON-ATTRIBUTION]
2026-07-30T11:57:02.1016482Z CONN_LIFECYCLE: conn=6 role=brain stream-subscriber stream=1 viewer session=1 endpoint=reheal vid=0 wall_ms=1785412622101 mono_ms=153 event=viewer-attach session=1 vid=0 from_seq=0 [REQ-CONN-POISON-ATTRIBUTION]
2026-07-30T11:57:02.1018881Z SUBSCRIBE_DECISION: session=1 endpoint=reheal by=fd1724385aa0c75b64fb78cd602fa1d991fdebf76b13c58ed702eac835e9f618 conn=6 intent=viewer old_by=- old_gen=0 req_gen=0 decision=viewer
2026-07-30T11:57:02.1020691Z CONN_LIFECYCLE: conn=6 role=brain stream-subscriber stream=1 viewer session=1 endpoint=reheal vid=0 viewer session=1 endpoint=reheal vid=1 wall_ms=1785412622101 mono_ms=153 event=viewer-attach session=1 vid=1 from_seq=0 [REQ-CONN-POISON-ATTRIBUTION]
2026-07-30T11:57:02.1023065Z SUBSCRIBE_DECISION: session=1 endpoint=reheal by=fd1724385aa0c75b64fb78cd602fa1d991fdebf76b13c58ed702eac835e9f618 conn=6 intent=viewer old_by=- old_gen=0 req_gen=0 decision=viewer
2026-07-30T11:57:02.1371013Z 
2026-07-30T11:57:02.1371297Z running 1 test
2026-07-30T11:57:02.1716439Z NTP_TOTP_UNCORRECTED: all NTP servers unreachable — ceremony clock = raw system clock
2026-07-30T11:57:02.1826351Z CONN_LIFECYCLE: conn=1 role=brain wall_ms=1785412622182 mono_ms=0 event=transport-close poisoned=false timed_out=false [REQ-CONN-POISON-ATTRIBUTION]
2026-07-30T11:57:02.1828661Z CONN_LIFECYCLE: conn=3 role=brain wall_ms=1785412622182 mono_ms=0 event=write-start [REQ-CONN-POISON-ATTRIBUTION]
2026-07-30T11:57:02.2007448Z CONN_LIFECYCLE: conn=2 role=brain controller session=1 endpoint=reheal by=local wall_ms=1785412622200 mono_ms=18 event=controller-attach session=1 from_seq=0 [REQ-CONN-POISON-ATTRIBUTION]
2026-07-30T11:57:02.2012752Z CONN_LIFECYCLE: conn=2 role=brain controller session=1 endpoint=reheal by=local wall_ms=1785412622201 mono_ms=18 event=write-start [REQ-CONN-POISON-ATTRIBUTION]
2026-07-30T11:57:03.1230708Z CONN_LIFECYCLE: conn=4 role=brain wall_ms=1785412623122 mono_ms=940 event=write-start [REQ-CONN-POISON-ATTRIBUTION]
2026-07-30T11:57:03.1370284Z CONN_LIFECYCLE: conn=4 role=brain stream-subscriber stream=2 wall_ms=1785412623136 mono_ms=954 event=stream-sub-attach stream=2 from_seq=0 [REQ-CONN-POISON-ATTRIBUTION]
2026-07-30T11:57:03.1401090Z CONN_LIFECYCLE: conn=5 role=brain wall_ms=1785412623140 mono_ms=957 event=write-start [REQ-CONN-POISON-ATTRIBUTION]
2026-07-30T11:57:03.1402357Z CONN_LIFECYCLE: conn=5 role=brain wall_ms=1785412623140 mono_ms=957 event=transport-close poisoned=false timed_out=false [REQ-CONN-POISON-ATTRIBUTION]
2026-07-30T11:57:03.1405317Z CONN_LIFECYCLE: conn=6 role=brain wall_ms=1785412623140 mono_ms=957 event=write-start [REQ-CONN-POISON-ATTRIBUTION]
2026-07-30T11:57:03.1407030Z CONN_LIFECYCLE: conn=6 role=brain stream-subscriber stream=1 wall_ms=1785412623140 mono_ms=958 event=stream-sub-attach stream=1 from_seq=0 [REQ-CONN-POISON-ATTRIBUTION]
2026-07-30T11:57:03.1410157Z CONN_LIFECYCLE: conn=6 role=brain stream-subscriber stream=1 viewer session=1 endpoint=reheal vid=0 wall_ms=1785412623140 mono_ms=958 event=viewer-attach session=1 vid=0 from_seq=0 [REQ-CONN-POISON-ATTRIBUTION]
2026-07-30T11:57:03.1412879Z SUBSCRIBE_DECISION: session=1 endpoint=reheal by=fd1724385aa0c75b64fb78cd602fa1d991fdebf76b13c58ed702eac835e9f618 conn=6 intent=viewer old_by=- old_gen=0 req_gen=0 decision=viewer
2026-07-30T11:57:03.1414537Z CONN_LIFECYCLE: conn=6 role=brain stream-subscriber stream=1 viewer session=1 endpoint=reheal vid=0 viewer session=1 endpoint=reheal vid=1 wall_ms=1785412623141 mono_ms=958 event=viewer-attach session=1 vid=1 from_seq=0 [REQ-CONN-POISON-ATTRIBUTION]
2026-07-30T11:57:03.1416190Z SUBSCRIBE_DECISION: session=1 endpoint=reheal by=fd1724385aa0c75b64fb78cd602fa1d991fdebf76b13c58ed702eac835e9f618 conn=6 intent=viewer old_by=- old_gen=0 req_gen=0 decision=viewer
2026-07-30T11:57:03.4620495Z CONN_LIFECYCLE: conn=6 role=brain stream-subscriber stream=1 viewer session=1 endpoint=reheal vid=0 viewer session=1 endpoint=reheal vid=1 wall_ms=1785412623461 mono_ms=1279 event=stream-sub-release stream=1 [REQ-CONN-POISON-ATTRIBUTION]
2026-07-30T11:57:03.4621530Z CONN_LIFECYCLE: conn=7 role=brain wall_ms=1785412623461 mono_ms=1279 event=transport-close poisoned=false timed_out=false [REQ-CONN-POISON-ATTRIBUTION]
2026-07-30T11:57:03.4680346Z test rc::tests::attach_viewport_reconnects_across_a_broker_bounce ... ok
2026-07-30T11:57:03.5735787Z test rc::tests::establish_attach_reuses_the_probes_carried_pump_conn ... ok
2026-07-30T11:57:05.7383017Z test rc::tests::qualified_targets_attach_with_bare_wire_id ... ok
2026-07-30T11:57:07.2514332Z test roster::tests::detect_self_by_ancestry_none_when_no_ancestor_owns_a_perch ... ok
2026-07-30T11:57:07.2738739Z test roster::tests::detect_self_by_ancestry_resolves_a_live_ancestor_perch ... ok
2026-07-30T11:57:07.2861324Z test roster::tests::detect_self_id_endpoint_id_leg_is_label_only_and_perch_gated ... ok
2026-07-30T11:57:07.3170891Z test roster::tests::detect_self_id_resolves_identity_with_zero_git_spawns ... ok
2026-07-30T11:57:07.3258535Z test roster::tests::detect_self_resolves_spt_hosted_perch_via_parent_pid ... ok
2026-07-30T11:57:07.3277936Z test roster::tests::enumerate_yields_offline_corrupt_row_for_unparseable_info ... ok
2026-07-30T11:57:07.3487484Z test roster::tests::list_all_perch_dirs_enumerates_nested_psyche_for_self_resolution ... ok
2026-07-30T11:57:07.3696332Z test roster::tests::parent_pid_candidates_stay_ancestry_gated ... ok
2026-07-30T11:57:07.7646460Z test wansend::tests::remote_rest_suspends_and_wakes_with_the_deferred_gate ... ok
2026-07-30T11:57:07.8303392Z test wansend::tests::resolve_and_dial_owner_dials_the_resolved_node ... ok
2026-07-30T11:57:07.8801549Z test wansend::tests::resolve_and_dial_owner_is_honest_on_resolution_misses ... ok
2026-07-30T11:57:07.8907755Z test wansend::tests::seed_first_addr_prefers_the_cached_direct_address ... ok
2026-07-30T11:57:08.0956717Z test wansend::tests::wan_send_ships_to_the_resolved_node ... ok
2026-07-30T11:57:08.0957005Z 
2026-07-30T11:57:08.0958214Z test result: ok. 469 passed; 0 failed; 0 ignored; 0 measured; 0 filtered out; finished in 59.09s
2026-07-30T11:57:08.0958618Z 
2026-07-30T11:57:08.1206999Z      Running unittests tests\fixtures\translate_proof_fixture.rs (target\debug\deps\translate_proof_fixture-1589c58e8ed1aadb.exe)
2026-07-30T11:57:08.2695657Z 
2026-07-30T11:57:08.2695944Z running 0 tests
2026-07-30T11:57:08.2696080Z 
2026-07-30T11:57:08.2696267Z test result: ok. 0 passed; 0 failed; 0 ignored; 0 measured; 0 filtered out; finished in 0.00s
2026-07-30T11:57:08.2696477Z 
2026-07-30T11:57:08.2711271Z      Running unittests src\lib.rs (target\debug\deps\spt_daemon-85fe692ab1a69039.exe)
2026-07-30T11:57:09.0299954Z 
2026-07-30T11:57:09.0300274Z running 722 tests
2026-07-30T11:57:09.0305021Z test access::tests::the_knock_exemption_hook_refuses_everything_today ... ok
2026-07-30T11:57:09.0305439Z test access::tests::the_inbound_lock_answers_replies_only_and_only_while_controlled ... ok
2026-07-30T11:57:09.0307732Z test activity::tests::an_unseen_link_owes_a_push ... ok
2026-07-30T11:57:09.0308185Z test activity::tests::a_token_change_with_an_identical_state_owes_a_push ... ok
2026-07-30T11:57:09.0309170Z test activity::tests::an_identical_observation_pushes_nothing ... ok
2026-07-30T11:57:09.0309771Z test activity::tests::a_state_change_owes_a_push_both_directions ... ok
2026-07-30T11:57:09.0311387Z test activity::tests::remember_forgets_a_vanished_link_so_its_return_re_pushes ... ok
2026-07-30T11:57:09.0313119Z test activity::tests::the_diff_is_per_link_not_per_owner ... ok
2026-07-30T11:57:09.0317831Z test activity::tests::observe_links_on_an_absent_owlery_is_empty ... ok
2026-07-30T11:57:09.0319712Z test adapter_update::tests::delegated_attested_delegates_command ... ok
2026-07-30T11:57:09.0320973Z test adapter_update::tests::delegated_unattested_is_skipped ... ok
2026-07-30T11:57:09.0333932Z test activity::tests::the_flip_marker_is_idempotent_to_drop_and_taken_exactly_once ... ok
2026-07-30T11:57:09.0413329Z test adapter_update::tests::file_pull_tampered_bytes_rejected ... ok
2026-07-30T11:57:09.0416875Z test adapter_update::tests::file_pull_without_payload_is_skipped ... ok
2026-07-30T11:57:09.0424326Z test adapter_update::tests::file_pull_verified_against_adapter_key ... ok
2026-07-30T11:57:09.0425847Z test adapter_update::tests::gh_release_is_managed_cli_side_not_in_pure_plan ... ok
2026-07-30T11:57:09.0427172Z test activity::tests::an_owner_with_no_linked_shell_is_not_observed ... ok
2026-07-30T11:57:09.0441469Z test access::tests::corrupt_store_degrades_closed_but_replies_survive ... ok
2026-07-30T11:57:09.0456040Z test activity::tests::an_unstamped_owner_observes_undated_and_stays_silent_across_sweeps ... ok
2026-07-30T11:57:09.0467094Z test activity::tests::observe_links_sees_only_online_shells_holding_a_token ... ok
2026-07-30T11:57:09.0519779Z test adapter_update::tests::file_pull_wrong_key_rejected ... ok
2026-07-30T11:57:09.0525481Z test adapter_update::tests::ripple_conducts_each_adapter_in_order ... ok
2026-07-30T11:57:09.0734016Z test access::tests::gate_decision_table ... ok
2026-07-30T11:57:09.0780477Z test applyhost::tests::apply_staged_daemonless_swaps_binary_with_no_broker ... ok
2026-07-30T11:57:09.0795625Z test adapter_update::tests::ripple_registered_uses_the_registered_set ... ok
2026-07-30T11:57:09.0799507Z test applyhost::tests::apply_staged_daemonless_holds_the_fail_closed_gates ... ok
2026-07-30T11:57:09.0847617Z test access::tests::reply_passes_where_unsolicited_refused ... ok
2026-07-30T11:57:09.0876405Z test applyhost::tests::brain_restart_verb_raises_the_supervisor_signal ... ok
2026-07-30T11:57:09.0889234Z test applyhost::tests::broker_reports_its_compiled_image_version_over_ipc ... ok
2026-07-30T11:57:09.0894268Z test applyhost::tests::apply_staged_refuses_a_quarantined_version ... ok
2026-07-30T11:57:09.0897118Z test applyhost::tests::staged_already_applied_classifies_up_to_date_vs_newer ... ok
2026-07-30T11:57:09.0901578Z test attach::tests::the_engine_room_has_no_viewport_and_takes_its_controls_from_home ... ok
2026-07-30T11:57:09.0906263Z test applyhost::tests::refresh_brain_cycles_without_staging_or_swap_preconditions ... ok
2026-07-30T11:57:09.0922039Z test applyhost::tests::apply_staged_refuses_platform_blind_or_mismatched_single ... ok
2026-07-30T11:57:09.0952995Z test access::tests::discover_gate_discloses_per_viewer ... ok
2026-07-30T11:57:09.0975991Z test brain::tests::a_flagged_sync_frame_baselines_forward_never_backward_on_both_paths ... ok
2026-07-30T11:57:09.0983505Z test brain::tests::an_old_broker_wire_without_the_sync_key_keeps_every_legacy_path ... ok
2026-07-30T11:57:09.0993044Z test brain::tests::cold_brain_still_rejects_a_forward_output_gap ... ok
2026-07-30T11:57:09.1006963Z test brain::tests::controller_resume_from_floor_refetches_after_a_gap ... ok
2026-07-30T11:57:09.1007578Z test applyhost::tests::apply_staged_update_set_refuses_broker_touching_payloads ... ok
2026-07-30T11:57:09.1009314Z test brain::tests::peer_reply_deadline_caps_below_carrier_deadline ... ok
2026-07-30T11:57:09.1009814Z test brain::tests::reclassify_peer_reply_maps_timeout_off_poison ... ok
2026-07-30T11:57:09.1011302Z test applyhost::tests::apply_staged_gates_fail_closed_with_the_seat_untouched ... ok
2026-07-30T11:57:09.1013567Z test brainproc::tests::appended_padding_flips_exe_hash ... ok
2026-07-30T11:57:09.1016204Z test brainproc::tests::backoff_doubles_on_fast_death_resets_when_healthy ... ok
2026-07-30T11:57:09.1017322Z test brain::tests::skip_to_live_accepts_a_forward_seq_jump_via_snap_above ... ok
2026-07-30T11:57:09.1018767Z test brain::tests::viewer_snap_attach_accepts_a_forward_output_gap ... ok
2026-07-30T11:57:09.1019623Z test brainproc::tests::brain_child_args_carry_generation_and_reason ... ok
2026-07-30T11:57:09.1021794Z test brainproc::tests::bytes_gate_truth_table ... ok
2026-07-30T11:57:09.1022193Z test brainproc::tests::consumer_gate_spawns_once_when_net_enabled ... ok
2026-07-30T11:57:09.1049755Z test access::tests::gate_feeds_the_proven_sender_endpoint_tier ... ok
2026-07-30T11:57:09.1072475Z test applyhost::tests::apply_staged_without_broker_hosted_sessions_swaps_binary ... ok
2026-07-30T11:57:09.1154663Z test access::tests::gate_is_per_surface ... ok
2026-07-30T11:57:09.1164168Z test applyhost::tests::apply_staged_swaps_binary_and_hands_off_without_touching_the_endpoint ... ok
2026-07-30T11:57:09.1165915Z test brainproc::tests::ready_exe_hash_parses_and_is_n1_readable ... ok
2026-07-30T11:57:09.1209613Z test access::tests::discover_gate_withholds_everything_while_degraded ... ok
2026-07-30T11:57:09.1211636Z test brainproc::tests::ready_generation_parses_stamp_and_fails_safe ... ok
2026-07-30T11:57:09.1237776Z test brainproc::tests::ready_generation_at_reads_file_and_absent_is_none ... ok
2026-07-30T11:57:09.1239374Z test brainproc::tests::rollback_running_version_is_prior_not_n_minus_one ... ok
2026-07-30T11:57:09.1248596Z test applyhost::tests::apply_staged_update_set_selects_local_platform_artifact ... ok
2026-07-30T11:57:09.1249278Z test brainproc::tests::select_brain_exe_prefers_canonical_over_per_spawn_current_exe ... ok
2026-07-30T11:57:09.1452725Z test access::tests::same_node_always_passes_without_minting ... ok
2026-07-30T11:57:09.1454013Z test brainproc::tests::start_reason_arg_round_trips_and_is_lenient ... ok
2026-07-30T11:57:09.2258292Z test access::tests::the_engine_room_is_disclosed_only_to_the_viewers_it_chose ... ok
2026-07-30T11:57:09.2422243Z test access::tests::the_engine_room_refuses_even_this_nodes_own_unsolicited_inbound ... ok
2026-07-30T11:57:09.2601221Z test access::tests::the_inbound_lock_is_reached_through_the_sender_stamped_entry_point ... ok
2026-07-30T11:57:09.2633475Z test attach::tests::viewer_and_driving_intents_gate_on_different_surfaces ... ok
2026-07-30T11:57:09.2643031Z test autostart::tests::empty_config_is_a_pure_noop ... ok
2026-07-30T11:57:09.2659433Z test broker::tests::a_controller_resume_below_the_floor_is_served_the_repaint_shape ... ok
2026-07-30T11:57:09.2663399Z test broker::tests::a_failed_surface_resize_leaves_the_grid_geometry_unchanged ... ok
2026-07-30T11:57:09.2677356Z test broker::tests::a_full_controller_does_not_starve_a_viewer_or_block_the_drain ... ok
2026-07-30T11:57:09.2688383Z test broker::tests::a_gap_resume_on_the_same_conn_is_served_not_suppressed ... ok
2026-07-30T11:57:09.2691287Z test broker::tests::a_grow_keeps_old_geometry_wrapping_and_places_new_output_at_the_new_width ... ok
2026-07-30T11:57:09.2719276Z test autostart::tests::unresolved_adapter_loud_skips_before_any_launch ... ok
2026-07-30T11:57:09.2732217Z test broker::tests::a_resume_at_the_floor_keeps_the_raw_ring_replay ... ok
2026-07-30T11:57:09.2743297Z test broker::tests::a_resumed_controller_never_rereceives_a_suppressed_seq ... ok
2026-07-30T11:57:09.2745179Z test broker::tests::a_second_transition_is_refused_while_one_is_in_flight ... ok
2026-07-30T11:57:09.2747356Z test broker::tests::a_shrink_parses_held_output_at_the_geometry_it_was_emitted_under ... ok
2026-07-30T11:57:09.3369076Z test broker::tests::a_reap_clears_the_control_stamps_but_never_the_hosting_authority ... ok
2026-07-30T11:57:09.3936863Z test brainproc::tests::rolled_back_record_spawns_rollback_binary_on_a_fresh_supervisor ... ok
2026-07-30T11:57:09.3938910Z test broker::tests::advance_delivered_is_monotonic ... ok
2026-07-30T11:57:09.3952287Z test broker::tests::an_aborted_transition_syncs_at_the_old_geometry_with_no_size_frame ... ok
2026-07-30T11:57:09.3960268Z test broker::tests::append_overflow_flags_the_evicted_viewer_for_skip_to_live ... ok
2026-07-30T11:57:09.3970425Z test broker::tests::apply_once_enqueues_ptywrite_exactly_once_and_dedups_replay ... ok
2026-07-30T11:57:09.5513163Z test broker::tests::a_take_and_a_detach_each_drop_the_engine_rooms_empowerments ... ok
2026-07-30T11:57:09.5514301Z test broker::tests::chunk_text_splits_and_reassembles_exactly ... ok
2026-07-30T11:57:09.5525612Z test broker::tests::clamp_or_reset_resets_a_torn_ring_only ... ok
2026-07-30T11:57:09.5533994Z test broker::tests::cold_attach_repaint_plus_next_differential_matches_independent_emulator ... ok
2026-07-30T11:57:09.5535297Z test broker::tests::contains_subslice_finds_contiguous_only ... ok
2026-07-30T11:57:09.5536491Z test broker::tests::contiguous_advance_freezes_on_a_gap ... ok
2026-07-30T11:57:09.5546743Z test broker::tests::controller_write_stall_predicate_distinguishes_wedged_from_idle ... ok
2026-07-30T11:57:09.5547253Z test broker::tests::delivered_cursor_advances_only_on_ok_and_is_monotonic ... ok
2026-07-30T11:57:09.7122968Z test broker::tests::attach_initial_batch_is_a_clean_alt_screen_repaint_not_the_raw_ring ... ok
2026-07-30T11:57:09.7123632Z test broker::tests::echo_verified_catches_a_swallowed_head ... ok
2026-07-30T11:57:09.7137646Z test broker::tests::equal_generation_same_conn_is_an_idempotent_replay ... ok
2026-07-30T11:57:09.7146354Z test broker::tests::exit_enqueues_behind_queued_output_per_sink ... ok
2026-07-30T11:57:09.7157020Z test broker::tests::gap_resume_resubscribe_preserves_the_generation_against_stale_replay ... ok
2026-07-30T11:57:09.7173414Z test broker::tests::generation_ladder_newer_supersedes_loudly_older_refused_both_intents ... ok
2026-07-30T11:57:09.7175057Z test broker::tests::input_enqueue_drops_and_stamps_on_full_then_heals_on_drain ... ok
2026-07-30T11:57:09.7176741Z test broker::tests::input_writer_preserves_strict_fifo_order_through_the_sole_writer ... ok
2026-07-30T11:57:09.7196923Z test broker::tests::local_controller_wedged_scopes_to_the_brains_own_conn ... ok
2026-07-30T11:57:09.7200672Z test broker::tests::lock_floor_recovers_a_poisoned_inject_floor ... ok
2026-07-30T11:57:09.7201933Z test broker::tests::miss_respool_is_once_then_dead_letters ... ok
2026-07-30T11:57:09.7203280Z test broker::tests::miss_strikes_exhausted_at_budget ... ok
2026-07-30T11:57:09.7205016Z test broker::tests::only_the_supervised_generation_can_claim_the_coordinator_image ... ok
2026-07-30T11:57:09.7209269Z test broker::tests::output_log_tap_reads_bytes_since_snapshot ... ok
2026-07-30T11:57:09.7210610Z test broker::tests::pair_hold_lifecycle_decisions ... ok
2026-07-30T11:57:09.7211968Z test broker::tests::rc_input_fence_scopes_to_rc_minted_non_controller_input_only ... ok
2026-07-30T11:57:09.7292825Z test broker::tests::read_translation_command_none_when_absent ... ok
2026-07-30T11:57:09.7413456Z test broker::tests::read_translation_command_reads_declared ... ok
2026-07-30T11:57:09.7429707Z test broker::tests::a_viewer_below_the_floor_gets_the_repaint_and_skip_to_live_stays_empty ... ok
2026-07-30T11:57:09.7434077Z test broker::tests::reap_dead_controller_clears_a_finished_writer ... ok
2026-07-30T11:57:09.7437428Z test broker::tests::reap_dead_controller_leaves_a_live_writer_untouched ... ok
2026-07-30T11:57:09.7441342Z test broker::tests::reap_evicts_a_blocked_writer_not_only_an_exited_one ... ok
2026-07-30T11:57:09.7443884Z test broker::tests::recover_log_clamps_a_poisoned_torn_ring ... ok
2026-07-30T11:57:09.7444179Z test broker::tests::recover_reopens_a_poisoned_sessions_map ... ok
2026-07-30T11:57:09.7455433Z test broker::tests::revoked_incumbent_writer_emits_the_terminal_displaced ... ok
2026-07-30T11:57:09.7457024Z test broker::tests::select_endpoints_running_adapter_filters_dedups_sorts ... ok
2026-07-30T11:57:09.7458852Z test broker::tests::sessions_reply_resume_seq_defaults_when_absent ... ok
2026-07-30T11:57:09.7459354Z test broker::tests::same_identity_resubscribe_refuses_a_stale_generation ... ok
2026-07-30T11:57:09.7460165Z test broker::tests::should_settle_rearms_on_observable_pty ... ok
2026-07-30T11:57:09.7469667Z test broker::tests::stale_generation_detach_never_clears_the_newer_controller ... ok
2026-07-30T11:57:09.7480390Z test broker::tests::stalled_incumbent_is_evicted_on_reattach_and_control_released ... ok
2026-07-30T11:57:09.7481445Z test broker::tests::stamp_divergence_gates_writes ... ok
2026-07-30T11:57:09.8149517Z test broker::tests::stale_snapshot_stamp_write_refused_after_reap_generation_bump ... ok
2026-07-30T11:57:09.9111106Z test broker::tests::stamp_driven_by_latches_own_node_hex_verbatim_like_remote ... ok
2026-07-30T11:57:09.9594906Z test broker::tests::delivery_is_suppressed_during_a_transition_and_one_sync_frame_substitutes ... ok
2026-07-30T11:57:10.0883092Z test broker::tests::taking_the_engine_rooms_controls_costs_a_member_or_admin_code ... ok
2026-07-30T11:57:10.1712471Z test brainproc::tests::planned_restart_respawns_with_update_reason ... ok
2026-07-30T11:57:10.1716539Z test broker::tests::the_suppressed_window_is_exempt_from_the_controller_eviction_deadline ... ok
2026-07-30T11:57:10.1726607Z test broker::tests::tracked_state_inside_the_window_surfaces_in_the_sync_frame ... ok
2026-07-30T11:57:10.1731783Z test broker::tests::untracked_toggles_defer_into_the_sync_frame_and_hyperlinks_drop ... ok
2026-07-30T11:57:10.1733144Z test broker::tests::viewer_overflow_or_disconnect_evicts_never_blocks ... ok
2026-07-30T11:57:10.1859020Z test broker::tests::the_engine_room_refuses_every_viewport_and_every_off_node_attach ... ok
2026-07-30T11:57:10.1860106Z test broker::tests::wake_gate_decision_truth_table ... ok
2026-07-30T11:57:10.2211120Z test broker::tests::superseded_controller_writer_is_epoch_gated_silent_one_live_writer_per_conn ... ok
2026-07-30T11:57:10.2212081Z test broker::tests::wrapper_alive_prefers_the_table_and_falls_back_where_there_is_none ... ok
2026-07-30T11:57:10.2213001Z test broker::tests::zombie_verdict_table ... ok
2026-07-30T11:57:10.2214519Z test codec::tests::back_to_back_frames_decode_independently ... ok
2026-07-30T11:57:10.2216051Z test codec::tests::frame_round_trips_through_buffer ... ok
2026-07-30T11:57:10.2217235Z test codec::tests::oversized_prefix_rejected ... ok
2026-07-30T11:57:10.2284244Z test config::tests::auto_suspend_knob_is_opt_in_default_off ... ok
2026-07-30T11:57:10.2346173Z test config::tests::crash_grace_is_config_driven ... ok
2026-07-30T11:57:10.2406787Z test config::tests::detached_subnets_knob_defaults_empty ... ok
2026-07-30T11:57:10.2466140Z test config::tests::full_auto_update_is_gated_by_default ... ok
2026-07-30T11:57:10.2521826Z test config::tests::malformed_file_degrades_to_default ... ok
2026-07-30T11:57:10.2527232Z test config::tests::missing_file_is_default ... ok
2026-07-30T11:57:10.2582783Z test config::tests::pulse_period_is_config_driven ... ok
2026-07-30T11:57:10.2739552Z test config::tests::relay_choice_is_config_driven ... ok
2026-07-30T11:57:10.2800224Z test config::tests::save_load_roundtrip ... ok
2026-07-30T11:57:10.2926303Z test config::tests::startup_endpoints_roundtrip ... ok
2026-07-30T11:57:10.3153534Z test config::tests::upsert_startup_endpoint_appends_then_replaces_preserving_other_knobs ... ok
2026-07-30T11:57:10.3157138Z test conn::tests::conn_ids_are_unique_and_labels_stay_bounded ... ok
2026-07-30T11:57:10.3160753Z test conn::tests::organic_write_failure_still_poisons_and_is_not_the_timeout_class ... ok
2026-07-30T11:57:10.3163334Z test conn::tests::retirement_token_splits_deadline_from_organic_with_attribution_parity ... ok
2026-07-30T11:57:10.3164370Z test consent::tests::decide_honors_full_auto_flag ... ok
2026-07-30T11:57:10.3491217Z test consent::tests::no_live_session_resolves_to_none ... ok
2026-07-30T11:57:10.3760405Z test brainproc::tests::exe_hash_computed_exactly_once_across_n_publishes ... ok
2026-07-30T11:57:11.0258474Z test crc_swap::tests::apply_rollback_never_strands ... ok
2026-07-30T11:57:11.0295897Z test brainproc::tests::ready_but_wrong_bytes_rolls_back_never_promotes ... ok
2026-07-30T11:57:11.0357559Z test brainproc::tests::clear_before_spawn_defeats_exact_generation_stale_file ... ok
2026-07-30T11:57:11.0403542Z test crc_swap::tests::crash_recovery_missing_target_keeps_last_good_old ... ok
2026-07-30T11:57:11.0413751Z test brainproc::tests::ready_but_old_gen_never_drains_does_not_promote_rolls_back ... ok
2026-07-30T11:57:11.0459888Z test crc_swap::tests::displace_picks_fresh_old_name_and_gc_sweeps_stale ... ok
2026-07-30T11:57:11.0464446Z test brainproc::tests::ready_candidate_promotes_once_old_gen_drains ... ok
2026-07-30T11:57:11.0544384Z test crc_swap::tests::apply_swaps_changed_creates_new_untouched_identical ... ok
2026-07-30T11:57:11.0544956Z test crc_swap::tests::swap_error_carries_op_and_paths ... ok
2026-07-30T11:57:11.0555817Z test brainproc::tests::ready_with_matching_bytes_promotes ... ok
2026-07-30T11:57:11.0595257Z test crc_swap::tests::plan_recurses_nested_dirs ... ok
2026-07-30T11:57:11.0595678Z test crc_swap::tests::plan_selects_only_changed ... ok
2026-07-30T11:57:11.0848217Z test daemon::tests::a_scrubbed_variable_never_reaches_the_child ... ok
2026-07-30T11:57:11.0851778Z test daemon::tests::drive_ladder_all_err_returns_last_err ... ok
2026-07-30T11:57:11.0853862Z test daemon::tests::drive_ladder_falls_through_to_next_rung_on_err ... ok
2026-07-30T11:57:11.0855646Z test daemon::tests::drive_ladder_picks_first_ok_rung ... ok
2026-07-30T11:57:11.0857096Z test daemon::tests::ensure_declines_only_against_a_standing_operator_stop ... ok
2026-07-30T11:57:11.0921985Z test brainproc::tests::trial_promotes_on_ready_then_supervises_the_accepted_binary ... ok
2026-07-30T11:57:11.1086815Z test broker::tests::supervised_worker_panic_faults_and_reaps_child ... ok
2026-07-30T11:57:11.1087582Z test daemon::tests::launch_ladder_order_is_wmi_schtasks_breakaway_injob ... ok
2026-07-30T11:57:11.1088602Z test daemon::tests::net_retry_backoff_doubles_then_caps ... ok
2026-07-30T11:57:11.1089608Z test daemon::tests::null_std_handles_only_on_a_pipe_stderr ... ok
2026-07-30T11:57:11.1212864Z test daemon::tests::breakaway_spawn_escapes_a_kill_on_close_job ... ok
2026-07-30T11:57:11.1213983Z test daemon::tests::the_refusal_line_names_the_remedy ... ok
2026-07-30T11:57:11.1215428Z test daemon::tests::windows_arg_quoting_roundtrips_the_rules ... ok
2026-07-30T11:57:11.1217040Z test daemon::tests::wmi_create_script_carries_the_no_window_startup_spec ... ok
2026-07-30T11:57:11.1218346Z test deadline::tests::advance_after_fire_steps_one_grid_normally_and_collapses_a_stall ... ok
2026-07-30T11:57:11.1319702Z test broker::tests::windows_session_is_zombie_sees_a_handle_held_corpse_as_dead ... ok
2026-07-30T11:57:11.1419717Z test daemon::tests::spawn_env_additions_reach_the_child_and_keep_the_inherited_environment ... ok
2026-07-30T11:57:11.1437421Z test daemon::tests::a_tree_teardown_reaches_a_grandchild_the_service_spawned ... ok
2026-07-30T11:57:11.1438527Z test deadline::tests::next_fire_between_grid_points_rounds_up ... ok
2026-07-30T11:57:11.1439130Z test deadline::tests::next_fire_long_jump_collapses_missed_ticks_to_one ... ok
2026-07-30T11:57:11.1440306Z test deadline::tests::next_fire_on_grid_returns_now_and_advances_strictly ... ok
2026-07-30T11:57:11.1441282Z test deadline::tests::next_fire_saturates_when_now_precedes_anchor ... ok
2026-07-30T11:57:11.1442308Z test deadline::tests::one_shot_fires_at_or_after_target_and_never_resets ... ok
2026-07-30T11:57:11.1985689Z test brainproc::tests::trial_kills_alive_never_ready_candidate_before_rollback ... ok
2026-07-30T11:57:11.2471347Z test daemon::tests::detached_no_inherit_falls_back_under_a_breakaway_denying_job ... ok
2026-07-30T11:57:11.2472062Z test deadline::tests::zero_interval_degrades_to_config_default ... ok
2026-07-30T11:57:11.2473887Z test deelevate::tests::env_overlay_keeps_explicit_spt_home_alive ... ok
2026-07-30T11:57:11.2474784Z test deelevate::tests::plan_spawn_deelevates_only_with_a_target ... ok
2026-07-30T11:57:11.2476184Z test digest::tests::common_prefix_len_finds_the_unchanged_head ... ok
2026-07-30T11:57:11.2601505Z test brainproc::tests::stale_generation_minus_one_ready_never_promotes ... ok
2026-07-30T11:57:12.1854813Z test broker::tests::viewer_writer_emits_evicted_marker_only_on_an_evicted_close ... ok
2026-07-30T11:57:12.1856782Z test digest::tests::merge_by_ts_interleaves_context ... ok
2026-07-30T11:57:12.3226478Z test crc_swap::tests::mapped_old_does_not_brick_apply_displaces_aside ... ok
2026-07-30T11:57:12.3266902Z test daemon::tests::implicit_ensure_declines_without_clearing_the_inhibit ... ok
2026-07-30T11:57:12.3269377Z test digest::tests::resolve_config_precedence ... ok
2026-07-30T11:57:12.3272337Z test digest::tests::supersede_collapses_cross_generation_replay_to_newest ... ok
2026-07-30T11:57:12.3274670Z test digest::tests::supersede_is_noop_on_disjoint_sessions ... ok
2026-07-30T11:57:12.3278329Z test digest::tests::supersede_keeps_within_generation_repeats ... ok
2026-07-30T11:57:12.3281487Z test digest::tests::supersede_trims_divider_around_emptied_middle_generation ... ok
2026-07-30T11:57:12.3287861Z test digesthub::tests::dropped_subscriber_is_pruned ... ok
2026-07-30T11:57:12.3290979Z test digesthub::tests::project_and_publish_stores_latest ... ok
2026-07-30T11:57:12.3294296Z test digesthub::tests::publish_delta_is_tail_then_full_refresh ... ok
2026-07-30T11:57:12.3296366Z test digesthub::tests::render_is_glanceable ... ok
2026-07-30T11:57:12.3297872Z test digesthub::tests::subscribe_returns_current_base ... ok
2026-07-30T11:57:12.3300398Z test dispatch::tests::breaker_trips_with_doubling_capped_window_and_resets_on_progress ... ok
2026-07-30T11:57:12.3302800Z test dispatch::tests::classifies_every_family_by_first_line_shape ... ok
2026-07-30T11:57:12.3303469Z test brainproc::tests::supervisor_owns_generation_and_stamps_start_reason ... ok
2026-07-30T11:57:12.3304626Z test dispatch::tests::classify_failure_seat_blocked_is_exactly_the_three_discipline_strings ... ok
2026-07-30T11:57:12.3305145Z test dispatch::tests::cold_enumeration_claims_at_most_the_pool_bound_per_poll ... ok
2026-07-30T11:57:12.3306799Z test dispatch::tests::dispatch_event_carries_the_complete_key_set ... ok
2026-07-30T11:57:12.3307231Z test dispatch::tests::digest_pull_and_rest_never_read_as_each_other ... ok
2026-07-30T11:57:12.3308487Z test dispatch::tests::feed_accumulator_commits_per_bound_never_per_chunk ... ok
2026-07-30T11:57:12.3308990Z test dispatch::tests::finished_is_terminal_for_attach_only ... ok
2026-07-30T11:57:12.3310579Z test dispatch::tests::line_endpoint_resolves_each_family_identity_key ... ok
2026-07-30T11:57:12.3311444Z test dispatch::tests::oneway_seatblocked_strikes_out_terminal_while_request_reply_paces_forever ... ok
2026-07-30T11:57:12.3312096Z test dispatch::tests::only_the_old_broker_unknown_verb_answer_falls_back_to_the_peek ... ok
2026-07-30T11:57:12.3312673Z test dispatch::tests::seat_blocked_requeues_budget_free_paced_by_the_breaker_window ... ok
2026-07-30T11:57:12.3313876Z test dispatch::tests::transient_failure_requeues_bounded_and_terminal_never_reenters ... ok
2026-07-30T11:57:12.3314545Z test dispatch::tests::unknown_shapes_refuse_classification ... ok
2026-07-30T11:57:12.3315550Z test docshost::tests::content_types_cover_the_bundle_classes ... ok
2026-07-30T11:57:12.3316186Z test docshost::tests::port_resolution_env_config_default ... ok
2026-07-30T11:57:12.3317623Z test docshost::tests::sanitizer_admits_pages_and_rejects_escapes ... ok
2026-07-30T11:57:12.3319660Z test drivehub::tests::a_following_op_is_served_when_nothing_refused ... ok
2026-07-30T11:57:12.3321264Z test drivehub::tests::activity_and_drive_never_clobber_each_other ... ok
2026-07-30T11:57:12.3323207Z test drivehub::tests::activity_take_is_latest_wins_and_exactly_once ... ok
2026-07-30T11:57:12.3327816Z test drivehub::tests::a_foreign_owlery_is_refused_pre_ack_under_its_own_name ... ok
2026-07-30T11:57:12.3331023Z test drivehub::tests::clear_evicts_both_classes ... ok
2026-07-30T11:57:12.3333340Z test drivehub::tests::an_unknown_op_hangs_up_instead_of_being_swallowed ... ok
2026-07-30T11:57:12.3335353Z test drivehub::tests::clear_evicts_the_slot ... ok
2026-07-30T11:57:12.3339049Z test drivehub::tests::dead_generation_activity_frame_is_never_served ... ok
2026-07-30T11:57:12.3340301Z test drivehub::tests::dead_generation_frame_is_never_served ... ok
2026-07-30T11:57:12.3340978Z test drivehub::tests::drive_result_activity_key_is_additive_on_the_wire ... ok
2026-07-30T11:57:12.3341468Z test drivehub::tests::only_a_pre_ack_refusal_permits_a_second_spawn ... ok
2026-07-30T11:57:12.3342185Z test drivehub::tests::slots_are_per_owner ... ok
2026-07-30T11:57:12.3342851Z test drivehub::tests::take_is_exactly_once ... ok
2026-07-30T11:57:12.3344907Z test drivehub::tests::the_launch_reply_shapes_round_trip ... ok
2026-07-30T11:57:12.3349180Z test drivehub::tests::write_is_latest_wins ... ok
2026-07-30T11:57:12.3397744Z test brainproc::tests::supervisor_respawns_brain_until_stopped ... ok
2026-07-30T11:57:12.3414113Z test effect::tests::apply_once_does_not_hold_the_journal_lock_across_effect ... ok
2026-07-30T11:57:12.3754790Z test effect::tests::applied_set_survives_reopen ... ok
2026-07-30T11:57:12.4207175Z test effect::tests::failed_effect_is_not_recorded_applied ... ok
2026-07-30T11:57:12.4329966Z test consent::tests::resolves_most_recently_active_live_session ... ok
2026-07-30T11:57:12.4331351Z test effect::tests::marker_is_single_source_and_frozen ... ok
2026-07-30T11:57:12.4332960Z test effect::tests::minter_tag_round_trips ... ok
2026-07-30T11:57:12.4360653Z test effect::tests::open_creates_missing_parent_dirs ... ok
2026-07-30T11:57:12.4769998Z test effect::tests::poisoned_journal_lock_still_applies_subsequent_ops ... ok
2026-07-30T11:57:12.4819339Z test effect::tests::each_named_minter_namespaces_its_ops ... ok
2026-07-30T11:57:12.4978008Z test effect::tests::recover_is_migration_free ... ok
2026-07-30T11:57:12.4987380Z test effect::tests::second_apply_for_same_key_is_deduped ... ok
2026-07-30T11:57:12.5078397Z test effect::tests::ptywrite_skips_the_durable_journal_write_while_netsend_persists ... ok
2026-07-30T11:57:12.5079893Z test effect::tests::with_tracing_retry_no_retry_on_success ... ok
2026-07-30T11:57:12.5081445Z test effect::tests::with_tracing_retry_passes_through_other_errors ... ok
2026-07-30T11:57:12.5082938Z test effect::tests::with_tracing_retry_retries_once_on_no_longer_held ... ok
2026-07-30T11:57:12.5084280Z test effect::tests::with_tracing_retry_terminal_is_public_language ... ok
2026-07-30T11:57:12.5086117Z test frame::tests::envelope_with_unknown_trailing_field_decodes_on_older_peer ... ok
2026-07-30T11:57:12.5087537Z test frame::tests::handshake_accepts_newer_brain_on_older_broker ... ok
2026-07-30T11:57:12.5088542Z test frame::tests::handshake_rejects_below_floor ... ok
2026-07-30T11:57:12.5089594Z test frame::tests::handshake_rejects_role_mismatch ... ok
2026-07-30T11:57:12.5090870Z test frame::tests::unknown_kind_is_not_a_decode_error ... ok
2026-07-30T11:57:12.5092126Z test grants::tests::escalation_answers_apply ... ok
2026-07-30T11:57:12.5093514Z test grants::tests::escalation_ask_body_roundtrip ... ok
2026-07-30T11:57:12.5281170Z test effect::tests::shellchan_and_rc_same_session_dont_collide ... ok
2026-07-30T11:57:12.5282373Z test grants::tests::no_session_escalates_with_none_target ... ok
2026-07-30T11:57:12.5283832Z test grants::tests::preconsent_flags_author_grants ... ok
2026-07-30T11:57:12.5285223Z test grants::tests::reserved_capabilities_refuse_even_when_granted ... ok
2026-07-30T11:57:12.5286424Z test grants::tests::ungranted_escalates_granted_allows ... ok
2026-07-30T11:57:12.5290168Z test harnesshost::tests::mint_session_id_is_fresh_hex ... ok
2026-07-30T11:57:12.5294775Z test harnesshost::tests::node_key_fills_advertised_label_in_session_template ... ok
2026-07-30T11:57:12.5297492Z test harnesshost::tests::node_missing_reference_fails_loud ... ok
2026-07-30T11:57:12.5301823Z test harnesshost::tests::prepare_fails_closed_on_wrong_kind_missing_role_and_bad_template ... ok
2026-07-30T11:57:12.5305789Z test harnesshost::tests::prepare_fills_env_inject_values_with_substitution ... ok
2026-07-30T11:57:12.5308584Z test harnesshost::tests::prepare_fills_id_and_session_into_self_command ... ok
2026-07-30T11:57:12.5311451Z test harnesshost::tests::prepare_resume_falls_back_to_self_when_no_resume_role ... ok
2026-07-30T11:57:12.5314500Z test harnesshost::tests::prepare_selects_resume_template_on_resume_else_self ... ok
2026-07-30T11:57:12.5319758Z test harnesshost::tests::prepare_threads_translation_binary_when_declared ... ok
2026-07-30T11:57:12.5322140Z test harnesshost::tests::provisional_session_id_recognizes_own_mint_only ... ok
2026-07-30T11:57:12.5347101Z test harnesshost::tests::translation_binary_resolves_against_install_dir ... ok
2026-07-30T11:57:12.5436208Z test brainproc::tests::trial_rolls_back_after_budget_of_pre_ready_exits ... ok
2026-07-30T11:57:12.5824750Z test effect::tests::gauntlet_is_exactly_once_across_brain_crashes ... ok
2026-07-30T11:57:12.6498692Z test drivehub::tests::the_pre_ack_causes_are_three_distinct_diagnostics ... ok
2026-07-30T11:57:16.1047226Z test daemon::tests::a_captured_spawn_inherits_only_the_handle_in_its_allowlist ... FAILED
2026-07-30T11:57:18.3753864Z test daemon::tests::is_running_tracks_the_seed_channel ... ok
2026-07-30T11:57:18.5502184Z test deadline::tests::cold_and_crash_write_fresh_anchor_at_now ... ok
2026-07-30T11:57:18.5588284Z test deadline::tests::corrupt_file_degrades_to_fresh ... ok
2026-07-30T11:57:18.5611096Z test deadline::tests::distinct_keys_do_not_cross_clobber ... ok
2026-07-30T11:57:18.5612667Z test lifecycle::tests::event_turn_timeout_floors_at_thirty_seconds ... ok
2026-07-30T11:57:18.5615701Z test lifecycle::tests::first_turn_psyche_context_is_never_empty ... ok
2026-07-30T11:57:18.5637541Z test deadline::tests::update_keeps_anchor_and_refreshes_interval ... ok
2026-07-30T11:57:18.5639641Z test lifecycle::tests::is_owlery_internal_cases ... ok
2026-07-30T11:57:18.5649700Z test deadline::tests::update_with_no_file_falls_back_fresh ... ok
2026-07-30T11:57:18.8193706Z test digest::tests::extractor_spans_sessions_with_a_boundary_marker ... ok
2026-07-30T11:57:18.8398895Z test digest::tests::log_less_two_origin_merge_interleaves_by_ts ... ok
2026-07-30T11:57:18.8603641Z test digest::tests::projects_a_log_less_endpoint_from_digest_log ... ok
2026-07-30T11:57:18.8611774Z test digest::tests::projects_empty_for_a_sourceless_endpoint ... ok
2026-07-30T11:57:18.8614186Z test lifecycle::tests::psyche_turn_keys_carry_custody_sids_and_context_file_path ... ok
2026-07-30T11:57:18.8615444Z test lifecycle::tests::psyche_turn_strikes_exhausted_boundary ... ok
2026-07-30T11:57:18.8679036Z test lifecycle::tests::psyche_context_file_continue_is_zero_bytes_fresh_is_nonempty ... ok
2026-07-30T11:57:19.0260516Z test grants::tests::escalation_notif_fires_to_most_recent_and_roundtrips ... ok
2026-07-30T11:57:19.1869528Z test inject::tests::has_parked_idle_spool_gates_on_idle_hosted_and_pending ... ok
2026-07-30T11:57:19.3453445Z test inject::tests::shared_inject_leg_detects_spt_hosted ... ok
2026-07-30T11:57:19.3733374Z test lifecycle::tests::base_keys_carries_single_subnet_no_home ... ok
2026-07-30T11:57:19.4145636Z test lifecycle::tests::crash_signoff_spares_recovered_self ... ok
2026-07-30T11:57:19.5622500Z test lifecycle::tests::crash_signoff_tears_down_when_still_gone ... ok
2026-07-30T11:57:19.5972577Z test lifecycle::tests::custody_survives_parent_boundary_and_reseed_clears ... ok
2026-07-30T11:57:19.6497736Z test lifecycle::tests::echo_fire_resolves_relative_commune_dir_against_endpoint_cwd ... ok
2026-07-30T11:57:19.6641847Z test lifecycle::tests::echo_fire_skips_loud_on_relative_dir_without_cwd ... ok
2026-07-30T11:57:19.6904959Z test lifecycle::tests::harness_owner_gone_anchors_on_parent_pid ... ok
2026-07-30T11:57:19.6906190Z test lifecycle::tests::resolve_endpoint_drop_dir_cases ... ok
2026-07-30T11:57:19.6925262Z test lifecycle::tests::manifest_cell_refresh_swaps_manifest_and_runtime ... ok
2026-07-30T11:57:19.6935710Z test lifecycle::tests::node_key_fills_advertised_label_in_lifecycle_base_keys ... ok
2026-07-30T11:57:19.7846749Z test lifecycle::tests::orphan_watch_fires_on_dead_owner ... ok
2026-07-30T11:57:19.7847959Z test lifecycle::tests::session_not_found_discriminates_reseed_from_strike ... ok
2026-07-30T11:57:19.7942551Z test lifecycle::tests::orphan_watch_honors_stop_for_live_owner ... ok
2026-07-30T11:57:19.9026048Z test lifecycle::tests::psyche_turn_threads_parent_read_env_into_spawn ... ok
2026-07-30T11:57:19.9346887Z test lifecycle::tests::pulse_loop_does_not_write_anchor_per_fire ... ok
2026-07-30T11:57:19.9670668Z test lifecycle::tests::pulse_loop_is_config_paced_and_killable ... ok
2026-07-30T11:57:19.9676141Z test linkhost::tests::per_capability_act_gate_blocks_until_class_scoped_grant ... ok
2026-07-30T11:57:20.0370743Z test lifecycle::tests::pulse_loop_update_preserves_phase_crash_rebases ... ok
2026-07-30T11:57:20.1033509Z test lifecycle::tests::pulse_recency_and_auto_suspend_follow_resting_state ... ok
2026-07-30T11:57:22.0275648Z test lifecycle::tests::pulse_tick_ingests_drop ... ok
2026-07-30T11:57:24.1047331Z test lifecycle::tests::relative_commune_dir_resolves_against_endpoint_cwd_and_fills_project_branch ... ok
2026-07-30T11:57:24.1179536Z test lifecycle::tests::reload_fires_on_disk_change ... ok
2026-07-30T11:57:24.1351764Z test lifecycle::tests::reload_keeps_last_good_on_unparseable ... ok
2026-07-30T11:57:24.1419254Z test lifecycle::tests::reload_noop_when_unchanged ... ok
2026-07-30T11:57:24.1431653Z test lifecycle::tests::reload_noop_without_install_dir ... ok
2026-07-30T11:57:24.1433623Z test livehost::tests::decide_resume_goal_table ... ok
2026-07-30T11:57:24.3145935Z test lifecycle::tests::rest_edge_echo_success_clears_stale_psyche_stamp ... ok
2026-07-30T11:57:24.3147148Z test livehost::tests::hybrid_self_heal_due_table ... ok
2026-07-30T11:57:24.3354208Z test livehost::tests::legacy_psyche_sweep_guard_is_id_specific_and_fail_safe ... ok
2026-07-30T11:57:24.3586685Z test livehost::tests::live_bin_gc_removes_own_copy_and_displaces_when_locked ... ok
2026-07-30T11:57:24.5562067Z test lifecycle::tests::rest_event_fires_echo_once_and_wake_resurfaces ... ok
2026-07-30T11:57:24.9255350Z test lifecycle::tests::role_less_manifest_ticks_strike_free ... ok
2026-07-30T11:57:25.0037419Z test lifecycle::tests::thrash_budget_trips_on_a_synthetic_failure_loop_without_touching_status ... ok
2026-07-30T11:57:25.0326867Z test lifecycle::tests::turn_budget_stamps_on_exhaustion_and_clears_on_success ... ok
2026-07-30T11:57:25.2244868Z test linkhost::tests::cmd_wakes_a_stale_online_persistent_instance ... ok
2026-07-30T11:57:25.6652438Z test linkhost::tests::gateway_typed_owner_resolves_and_drives_keyed_on_id_not_type ... ok
2026-07-30T11:57:25.8224302Z test linkhost::tests::prepare_drive_is_live_or_drop_and_never_spools ... ok
2026-07-30T11:57:25.9481985Z test linkhost::tests::relink_refuses_a_live_instance_but_recovers_a_stale_online_one ... ok
2026-07-30T11:57:26.0200440Z test linkhost::tests::run_action_drive_drops_offline_without_wake_or_spool ... ok
2026-07-30T11:57:26.1571564Z test linkhost::tests::run_action_refuses_gated_op_without_spooling ... ok
2026-07-30T11:57:26.6220772Z test linkhost::tests::run_action_relinks_drives_and_refuses ... ok
2026-07-30T11:57:29.1017547Z test livehost::tests::boot_gate_offlines_sessionless_controllable_then_reconcile_skips_host ... ok
2026-07-30T11:57:29.1018362Z test livehost::tests::reconcile_routing_controllable_falls_through_to_broker_session_truth ... ok
2026-07-30T11:57:29.1697995Z test livehost::tests::broker_failure_skips_the_pass_never_mass_offlines ... ok
2026-07-30T11:57:29.2475240Z test livehost::tests::control_reap_clears_sticky_controlled_on_already_offline_perch ... ok
2026-07-30T11:57:29.3025947Z test livehost::tests::fresh_brain_rehydrates_an_online_live_endpoint ... ok
2026-07-30T11:57:29.3027125Z test livehost::tests::restart_resume_gate_reruns_the_orphaned_controllable_dead_set_regardless_of_state ... ok
2026-07-30T11:57:29.4069220Z test livehost::tests::pull_liveness_demotes_a_relay_held_endpoint_instead_of_offlining_it ... ok
2026-07-30T11:57:29.4070572Z test machineid::tests::hash_is_domain_separated_and_stable ... ok
2026-07-30T11:57:29.6665389Z test livehost::tests::pull_liveness_marks_sessionless_spt_hosted_offline_only ... ok
2026-07-30T11:57:29.6666883Z test msg::tests::bytes_round_trip_through_payload ... ok
2026-07-30T11:57:29.6669388Z test msg::tests::endpoint_injected_envelope_carries_delivered_and_spool_hint ... ok
2026-07-30T11:57:29.6671139Z test msg::tests::endpoint_input_frames_round_trip ... ok
2026-07-30T11:57:29.6672729Z test msg::tests::evicted_envelope_round_trips ... ok
2026-07-30T11:57:29.6674613Z test msg::tests::input_req_absent_ack_defaults_true_n_minus_1_safe ... ok
2026-07-30T11:57:29.6676971Z test msg::tests::input_req_ack_false_round_trips_faithfully ... ok
2026-07-30T11:57:29.6679404Z test msg::tests::net_frames_round_trip_and_tolerate_unknown_fields ... ok
2026-07-30T11:57:29.6680599Z test msg::tests::output_envelope_round_trips ... ok
2026-07-30T11:57:29.6683390Z test msg::tests::output_sync_flag_defaults_absent_and_skips_when_false ... ok
2026-07-30T11:57:29.6685211Z test msg::tests::presence_event_round_trips_and_tolerates_future_kind ... ok
2026-07-30T11:57:29.6687613Z test msg::tests::spawn_req_tolerates_unknown_field ... ok
2026-07-30T11:57:29.6690074Z test msg::tests::stream_lifetime_is_additive_and_defaults_durable ... ok
2026-07-30T11:57:29.6692251Z test msg::tests::two_phase_join_wire_round_trips ... ok
2026-07-30T11:57:29.6694113Z test msg::tests::wire_decodes_old_shape_to_legacy ... ok
2026-07-30T11:57:29.6755537Z test nethost::tests::append_halts_at_first_failed_write_removes_the_seat_and_cancels_the_lease ... ok
2026-07-30T11:57:29.6761925Z test nethost::tests::attach_replay_never_interleaves_with_concurrent_live_appends ... ok
2026-07-30T11:57:29.6770149Z test nethost::tests::begin_attach_refuses_only_while_a_poisoned_prior_still_drains ... ok
2026-07-30T11:57:29.8142073Z test livehost::tests::pull_reconcile_offlines_perch_when_broker_session_dies ... ok
2026-07-30T11:57:29.8667363Z test livehost::tests::reconcile_attempts_resume_for_a_registered_woken_endpoint ... ok
2026-07-30T11:57:29.8845029Z test nethost::tests::bounded_block_on_cuts_a_never_completing_op_with_an_ordinary_error ... ok
2026-07-30T11:57:29.8889103Z test nethost::tests::dispatch_stream_infos_excludes_local_and_retired_rows_server_side ... ok
2026-07-30T11:57:29.8902738Z test nethost::tests::displaced_writer_failure_never_cancels_the_successor_lease ... ok
2026-07-30T11:57:29.8943919Z test nethost::tests::finish_halts_and_removes_a_poisoned_seat ... ok
2026-07-30T11:57:29.9197542Z test nethost::tests::host_binds_endpoint_to_node_identity ... ok
2026-07-30T11:57:29.9247872Z test nethost::tests::loopback_conn_is_a_reused_singleton_that_cross_wires_a_stream_pair ... ok
2026-07-30T11:57:29.9249326Z test nethost::tests::next_seq_counts_appends_not_logical_chunks ... ok
2026-07-30T11:57:29.9493183Z test nethost::tests::op_maps_are_minter_namespaced ... ok
2026-07-30T11:57:29.9646434Z test nethost::tests::open_class_routes_to_the_opener_row_only ... ok
2026-07-30T11:57:29.9649368Z test nethost::tests::opener_capture_gives_up_bounded_on_a_newline_less_stream ... ok
2026-07-30T11:57:29.9650795Z test nethost::tests::opener_pins_first_line_across_full_ring_roll ... ok
2026-07-30T11:57:29.9715343Z test nethost::tests::overflow_detaches_without_lease_cancel_and_the_brain_resumes_from_cursor ... ok
2026-07-30T11:57:29.9775275Z test nethost::tests::presence_log_mirrors_the_seat_discipline ... ok
2026-07-30T11:57:29.9776759Z test nethost::tests::retentive_log_is_lossless_ordered_while_ordinary_log_overwrites ... ok
2026-07-30T11:57:30.0008400Z test nethost::tests::retire_hides_the_row_while_active_rows_stay ... ok
2026-07-30T11:57:30.0080685Z test nethost::tests::conn_close_sweeps_its_stream_rows ... ok
2026-07-30T11:57:30.0275321Z test nethost::tests::retire_sweep_dismisses_the_seat_and_terminal_retire_drops_the_row ... ok
2026-07-30T11:57:30.0324513Z test nethost::tests::retired_row_still_flushes_a_late_reply ... ok
2026-07-30T11:57:30.0573067Z test nethost::tests::send_stream_refuses_on_a_canceled_lease ... ok
2026-07-30T11:57:30.0728668Z test nethost::tests::unsubscribe_releases_only_the_callers_seat_joins_writer_and_is_idempotent ... ok
2026-07-30T11:57:30.0945656Z test livehost::tests::reconcile_converges_a_dead_relay_and_spares_a_live_or_unproven_one ... ok
2026-07-30T11:57:30.0969157Z test machineid::tests::machine_id_hash_resolves_and_is_stable ... ok
2026-07-30T11:57:30.1008663Z test nethost::tests::two_hosts_dial_over_loopback ... ok
2026-07-30T11:57:30.1908023Z test livehost::tests::split_cleanup_clears_all_three_stamps_on_state_quirk_rows ... ok
2026-07-30T11:57:30.2451577Z test livehost::tests::reconcile_unhosts_on_offline_transition ... ok
2026-07-30T11:57:30.2727861Z test livehost::tests::reconcile_skips_an_offline_live_endpoint ... ok
2026-07-30T11:57:30.9974696Z test nethost::tests::loopback_tunnel_backpressures_without_loss ... ok
2026-07-30T11:57:34.5894995Z test livehost::tests::reconcile_refuses_a_woken_endpoint_with_an_unregistered_adapter ... ok
2026-07-30T11:57:34.6272602Z test livehost::tests::reconcile_skips_a_woken_endpoint_with_no_ledger_row ... ok
2026-07-30T11:57:34.6697063Z test livehost::tests::reconcile_keeps_driver_on_transient_read_fail_unhosts_on_dir_gone ... ok
2026-07-30T11:57:34.6986481Z test notif::tests::notif_command_renders_all_keys_and_is_opt_in ... ok
2026-07-30T11:57:34.7555049Z test livehost::tests::reconcile_marks_unbound_skeleton_offline_on_session_death ... ok
2026-07-30T11:57:34.9185848Z test livehost::tests::reconcile_reaps_orphaned_worker_and_spares_live_parent ... ok
2026-07-30T11:57:34.9471572Z test livehost::tests::reconcile_leaves_a_genuinely_suspended_endpoint_alone ... ok
2026-07-30T11:57:35.0213301Z test livehost::tests::reconcile_hosts_an_online_live_endpoint_and_drives_its_pulse ... ok
2026-07-30T11:57:35.0214623Z test notifgate::tests::an_unvalidatable_notify_passes ... ok
2026-07-30T11:57:35.0216521Z test notifgate::tests::distinct_notifs_both_deliver ... ok
2026-07-30T11:57:35.0891072Z test notifgate::tests::retain_preserves_order_of_the_survivors ... ok
2026-07-30T11:57:35.0893166Z test notifgate::tests::the_validity_gate_decision_table ... ok
2026-07-30T11:57:35.0958342Z test livehost::tests::reconcile_does_not_double_host ... ok
2026-07-30T11:57:35.3280070Z test notifsync::tests::concurrent_dismiss_and_surface_commute_across_the_feed ... ok
2026-07-30T11:57:35.3360286Z test notifsync::tests::feed_converges_two_stores_and_dismiss_replicates ... ok
2026-07-30T11:57:35.4530079Z test notif::tests::consent_decision_produces_notif_only_when_gated ... ok
2026-07-30T11:57:35.5269234Z test notifsync::tests::non_member_subnet_record_never_materializes ... ok
2026-07-30T11:57:35.5270665Z test pairhost::tests::a_re_postured_subnet_advises_and_never_applies ... ok
2026-07-30T11:57:35.5551792Z test notifsync::tests::node_scoped_rows_are_excluded_from_the_feed ... ok
2026-07-30T11:57:35.5553203Z test pairhost::tests::joiner_clock_render_shows_step_offset_and_state ... ok
2026-07-30T11:57:35.5554659Z test pairhost::tests::meet_failure_detail_concise_vs_verbose ... ok
2026-07-30T11:57:35.5557224Z test pairhost::tests::meet_final_retry_failing_surrenders_once ... ok
2026-07-30T11:57:35.5559349Z test pairhost::tests::meet_retries_once_after_refresh_on_exhaustion ... ok
2026-07-30T11:57:35.5560901Z test pairhost::tests::the_advisory_says_nothing_was_applied ... ok
2026-07-30T11:57:35.5562161Z test pairhost::tests::wire_errors_classify_for_the_guided_ux ... ok
2026-07-30T11:57:35.6012132Z test presence::tests::mra_degrades_to_local_and_skips_noise_rows ... ok
2026-07-30T11:57:35.6509309Z test presence::tests::mra_joins_local_and_gossiped_legs_under_one_max ... ok
2026-07-30T11:57:35.6607947Z test presence::tests::snapshot_loading_degrades_on_junk ... ok
2026-07-30T11:57:35.6699745Z test notifsync::tests::untrusted_and_cross_subnet_origins_are_dropped ... ok
2026-07-30T11:57:35.7272055Z test presence::tests::subnet_scope_gates_both_legs ... ok
2026-07-30T11:57:35.7459177Z test notif::tests::expired_row_is_auto_dismissed_at_boundary_not_surfaced ... ok
2026-07-30T11:57:35.7516169Z test projwriter::tests::cold_construct_spawns_no_git_and_first_cycle_publishes ... ok
2026-07-30T11:57:35.7719339Z test projwriter::tests::corrupt_index_is_repaired_and_counted ... ok
2026-07-30T11:57:35.9020384Z test notif::tests::first_fire_declines_an_already_expired_row ... ok
2026-07-30T11:57:36.0636280Z test projwriter::tests::cwd_invalidation_evicts_shared_cache_entry ... ok
2026-07-30T11:57:36.1524666Z test notif::tests::first_fire_reaches_most_recent_visible_endpoint ... ok
2026-07-30T11:57:36.3721365Z test notif::tests::first_fire_redirects_to_a_fresher_remote_winner_unmarked ... ok
2026-07-30T11:57:36.6043005Z test notif::tests::first_fire_rides_the_quiet_window_not_the_live_stream ... ok
2026-07-30T11:57:36.7544075Z test notif::tests::hidden_endpoint_boundary_surfaces_nothing ... ok
2026-07-30T11:57:36.7546005Z test propagate::tests::classifier_maps_every_status_shape ... ok
2026-07-30T11:57:36.8366785Z test projwriter::tests::ordinary_commit_is_noop_config_change_rederives ... ok
2026-07-30T11:57:36.9743572Z test notif::tests::hidden_endpoint_is_never_the_target ... ok
2026-07-30T11:57:37.0987945Z test notif::tests::no_live_endpoint_is_a_typed_no_target ... ok
2026-07-30T11:57:37.2899357Z test notif::tests::node_scoped_first_fire_ignores_a_fresher_remote_winner ... ok
2026-07-30T11:57:37.5031214Z test projwriter::tests::endpoint_events_patch_rows_and_drop_purged ... ok
2026-07-30T11:57:37.5057663Z test projwriter::tests::failed_cycle_preserves_last_known_good ... ok
2026-07-30T11:57:37.6090607Z test notif::tests::resurface_delivers_undismissed_with_gates ... ok
2026-07-30T11:57:37.9320672Z test projwriter::tests::warm_start_unchanged_generation_scans_nothing ... ok
2026-07-30T11:57:37.9322631Z test pump::health::tests::degraded_on_all_peer_failure_healthy_only_on_real_progress ... ok
2026-07-30T11:57:37.9444092Z test pump::health::tests::health_file_roundtrip_and_degrade ... ok
2026-07-30T11:57:37.9514733Z test pump::health::tests::registry_admit_stamp_survives_restart_rounds_and_never_regresses ... ok
2026-07-30T11:57:37.9516058Z test pump::health::tests::stage_parses_from_attributed_reasons ... ok
2026-07-30T11:57:40.3285839Z test notif::tests::rollback_notif_is_loud_and_resurfaces ... ok
2026-07-30T11:57:40.4145763Z test notif::tests::shell_notif_templates_render_for_attached_instances_only ... ok
2026-07-30T11:57:40.6668744Z test notif::tests::suppression_window_holds_cross_endpoint ... ok
2026-07-30T11:57:40.6867143Z test pump::registry::tests::fire_due_rotations_rotates_due_and_leaves_pending ... ok
2026-07-30T11:57:40.6879003Z test pump::registry::tests::poll_wake_takes_the_advertise_marker_exactly_once ... ok
2026-07-30T11:57:40.7355994Z test pairhost::tests::an_advisory_records_the_sighting_and_still_applies_nothing ... ok
2026-07-30T11:57:40.7365146Z test pump::tests::choreography_fan_targets_skips_detached_and_self ... ok
2026-07-30T11:57:40.7366593Z test pump::tests::choreography_first_tick_primes_all_legs ... ok
2026-07-30T11:57:40.7367935Z test pump::tests::choreography_mark_after_round_stamps_only_due ... ok
2026-07-30T11:57:40.7369289Z test pump::tests::choreography_peer_step_aborts_on_first_failure ... ok
2026-07-30T11:57:40.7370702Z test pump::tests::choreography_pre_round_once_and_before_any_peer_step ... ok
2026-07-30T11:57:40.7371734Z test pump::tests::choreography_wake_forces_only_that_worker ... ok
2026-07-30T11:57:40.7373031Z test pump::tests::drain_read_classifies_dead_carrier_as_restart_timeout_as_quiet ... ok
2026-07-30T11:57:40.7374118Z test pump::tests::first_tick_is_due_and_never_underflows ... ok
2026-07-30T11:57:40.7650428Z test pump::tests::heartbeat_writes_and_advances ... ok
2026-07-30T11:57:40.7652385Z test pump::tests::peer_leg_outcome_isolates_ordinary_backs_off_carrier_timeout_still_poisons ... ok
2026-07-30T11:57:40.7653983Z test pump::tests::per_peer_backoff_doubles_caps_and_eligibility ... ok
2026-07-30T11:57:40.7661149Z test pump::tests::presence_state_effect_correlates_and_isolates ... ok
2026-07-30T11:57:40.7996119Z test pump::tests::push_feed_retires_its_own_row_after_successful_fin ... ok
2026-07-30T11:57:40.7997542Z test pump::tests::push_target_is_the_full_roster_minus_self_and_tombstoned ... ok
2026-07-30T11:57:40.8135088Z test pump::tests::resolve_submit_addr_walks_the_route_chain ... ok
2026-07-30T11:57:40.8262938Z test pump::tests::startup_reconcile_heals_suspect_rows_and_migrates_invalid_ones ... ok
2026-07-30T11:57:40.8264336Z test pump::tests::supervisor_backoff_doubles_caps_and_resets ... ok
2026-07-30T11:57:40.8572320Z test pump::tests::supervisor_restarts_a_panicking_pump_until_stop ... ok
2026-07-30T11:57:40.8573640Z test pump::tests::wake_forces_a_round_regardless_of_cadence ... ok
2026-07-30T11:57:40.8574876Z test pump::update::tests::advertised_version_finds_dotted_tokens_and_refuses_counter_shapes ... ok
2026-07-30T11:57:40.8576161Z test pump::update::tests::the_retire_predicate_keeps_ahead_and_unparseable_rows ... ok
2026-07-30T11:57:40.8577318Z test pump::update::tests::version_ge_compares_dotted_versions_and_rejects_garbage ... ok
2026-07-30T11:57:41.3397718Z test projwriter::tests::writer_thread_debounces_burst_into_one_cycle ... ok
2026-07-30T11:57:41.3398770Z test reap::tests::reap_without_enroll_is_noop ... ok
2026-07-30T11:57:41.3400278Z test reconcile::tests::active_node_wins ... ok
2026-07-30T11:57:41.3401961Z test reconcile::tests::double_active_tiebreaks_deterministically ... ok
2026-07-30T11:57:41.3403127Z test reconcile::tests::fallback_lowest_non_offline ... ok
2026-07-30T11:57:41.3404529Z test reconcile::tests::no_rows_reconciles_locally ... ok
2026-07-30T11:57:41.3720871Z test registryhost::tests::admitted_feeds_stamp_the_heard_map ... ok
2026-07-30T11:57:41.4185882Z test projwriter::tests::batched_complexity_counters_hold ... ok
2026-07-30T11:57:41.5109716Z test psyrelay::tests::empty_and_oversize_bodies_drop_typed ... ok
2026-07-30T11:57:41.7538020Z test psyrelay::tests::notify_reaches_own_user_only ... ok
2026-07-30T11:57:41.9580243Z test psyrelay::tests::notify_without_live_endpoint_is_pending ... ok
2026-07-30T11:57:42.1295611Z test reap::tests::job_reaps_enrolled_child_and_grandchild ... ok
2026-07-30T11:57:42.1596297Z test psyrelay::tests::null_stdout_driver_fails_the_guard ... ok
2026-07-30T11:57:42.3745328Z test psyrelay::tests::prose_only_relays_nothing ... ok
2026-07-30T11:57:42.3904027Z test registryhost::tests::apply_feed_batch_writes_snapshots_once_with_per_kind_semantics_parity ... ok
2026-07-30T11:57:42.4029634Z test registryhost::tests::apply_feed_flips_only_on_observed_transition_to_active ... ok
2026-07-30T11:57:42.4079077Z test registryhost::tests::apply_feed_gates_and_merges_under_the_lease ... ok
2026-07-30T11:57:42.4195280Z test registryhost::tests::apply_node_labels_gates_and_merges ... ok
2026-07-30T11:57:42.7713056Z test psyrelay::tests::reply_relays_to_inbound_sender ... ok
2026-07-30T11:57:42.7802260Z test registryhost::tests::evict_aged_offline_rows_reaps_ghosts_and_rewrites_snapshots ... ok
2026-07-30T11:57:42.7917486Z test registryhost::tests::evict_silent_peers_drops_unheard_rows_and_rewrites_snapshots ... ok
2026-07-30T11:57:42.9374393Z test projwriter::tests::parity_full_ordered_list_vs_legacy_oracle ... ok
2026-07-30T11:57:42.9375773Z test registryhost::tests::gossip_controller_node_covers_any_controller ... ok
2026-07-30T11:57:42.9378448Z test registryhost::tests::recent_projects_cap_fires_on_output_length_not_scanned_rows ... ok
2026-07-30T11:57:42.9380733Z test registryhost::tests::recent_projects_derive_once_per_distinct_cwd ... ok
2026-07-30T11:57:42.9395793Z test psyrelay::tests::reply_without_target_is_dropped ... ok
2026-07-30T11:57:42.9687741Z test registryhost::tests::repair_evict_tombstones_roster_snapshot_and_notices ... ok
2026-07-30T11:57:42.9689356Z test registryhost::tests::superseded_requires_label_and_machine_id_under_other_key ... ok
2026-07-30T11:57:43.3343802Z test psyrelay::tests::spoofed_routing_is_stripped_and_restamped ... ok
2026-07-30T11:57:43.3368659Z test pump::registry::tests::disclosable_lines_keeps_the_per_subnet_filter ... ok
2026-07-30T11:57:43.3387834Z test registryhost::tests::with_epoch_is_the_one_canonical_counter ... ok
2026-07-30T11:57:43.3575201Z test pump::registry::tests::disclosable_lines_pushes_the_engine_room_only_to_its_chosen_viewer ... ok
2026-07-30T11:57:43.3656497Z test pump::registry::tests::discover_gate_filters_the_advert_push_per_viewer ... ok
2026-07-30T11:57:43.3964846Z test relcache::tests::applied_state_two_phase_round_trips_and_degrades ... ok
2026-07-30T11:57:43.4055035Z test relcache::tests::docs_bundle_stages_loads_and_clears_independently ... ok
2026-07-30T11:57:43.4085040Z test pump::registry::tests::pre_round_sweeps_and_refreshes_adverts_each_round ... ok
2026-07-30T11:57:43.4167779Z test relcache::tests::partial_update_set_can_serve_held_platform_only ... ok
2026-07-30T11:57:43.4196254Z test registryhost::tests::recent_projects_for_dedups_newest_first_excludes_owlery ... ok
2026-07-30T11:57:43.4250157Z test relcache::tests::single_platform_stamp_is_explicit_and_cleared_on_restage ... ok
2026-07-30T11:57:43.4293461Z test relcache::tests::torn_or_corrupt_stage_offers_nothing ... ok
2026-07-30T11:57:43.4302401Z test relcache::tests::update_set_round_trips_and_loads_by_platform ... ok
2026-07-30T11:57:43.4315333Z test relcache::tests::stage_round_trips_and_restage_replaces ... ok
2026-07-30T11:57:43.4384950Z test release::tests::artifact_digest_mismatch_is_rejected ... ok
2026-07-30T11:57:43.4386451Z test release::tests::current_platform_is_registered_or_unknown ... ok
2026-07-30T11:57:43.4389815Z test release::tests::docs_entry_is_additive_and_verifies_exact_bytes ... ok
2026-07-30T11:57:43.4402878Z test release::tests::builtin_keys_merge_and_revoke_under_file_overlay ... ok
2026-07-30T11:57:43.4404361Z test release::tests::hex_roundtrips ... ok
2026-07-30T11:57:43.4405843Z test release::tests::known_triples_project_the_registry ... ok
2026-07-30T11:57:43.4406531Z test release::tests::channel_mismatch_is_rejected ... ok
2026-07-30T11:57:43.4407098Z test release::tests::musl_platform_registered ... ok
2026-07-30T11:57:43.4478936Z test release::tests::expired_metadata_is_rejected ... ok
2026-07-30T11:57:43.4483584Z test release::tests::revoked_key_is_rejected ... ok
2026-07-30T11:57:43.4485315Z test release::tests::shipped_builtin_table_is_well_formed ... ok
2026-07-30T11:57:43.4522513Z test release::tests::production_policy_loads_fail_closed ... ok
2026-07-30T11:57:43.4572450Z test release::tests::tampered_metadata_fails_signature ... ok
2026-07-30T11:57:43.4615401Z test release::tests::untrusted_key_is_unknown ... ok
2026-07-30T11:57:43.4662159Z test release::tests::update_set_artifact_mismatch_is_rejected ... ok
2026-07-30T11:57:43.4667150Z test release::tests::non_monotonic_version_is_rollback ... ok
2026-07-30T11:57:43.4750013Z test release::tests::update_set_missing_platform_is_typed_rejection ... ok
2026-07-30T11:57:43.4750536Z test registryhost::tests::advertise_local_scans_and_respects_visibility ... ok
2026-07-30T11:57:43.4757669Z test release::tests::update_set_tampering_breaks_whole_set_signature ... ok
2026-07-30T11:57:43.4790122Z test release::tests::update_set_channel_and_rollback_gates_hold ... ok
2026-07-30T11:57:43.4839470Z test release::tests::valid_release_verifies_and_artifact_matches ... ok
2026-07-30T11:57:43.4840267Z test release::tests::update_set_verifies_and_selects_platform_artifact ... ok
2026-07-30T11:57:43.5014579Z test release::tests::verify_detached_signs_raw_artifact_bytes ... ok
2026-07-30T11:57:43.5016994Z test resting::tests::apply_event_miss_message_is_single_sourced ... ok
2026-07-30T11:57:46.4517450Z test registryhost::tests::advertise_local_stamps_the_node_label ... ok
2026-07-30T11:57:46.4696556Z test resting::tests::apply_event_no_spurious_echo_on_cold_void_suspend ... ok
2026-07-30T11:57:46.4707449Z test resting::tests::auto_suspend_counts_from_dormancy_onset_and_is_opt_in ... ok
2026-07-30T11:57:46.4711520Z test resting::tests::apply_event_echo_failure_is_loud_but_state_persists ... ok
2026-07-30T11:57:46.4974186Z test registryhost::tests::advertised_status_ignores_host_error ... ok
2026-07-30T11:57:46.4976059Z test resting::tests::effective_rest_state_table ... ok
2026-07-30T11:57:46.4997068Z test resting::tests::freshness_pull_marker_is_taken_exactly_once ... ok
2026-07-30T11:57:46.4998529Z test resting::tests::knob_chain_resolves_global_node_endpoint ... ok
2026-07-30T11:57:46.5065651Z test resting::tests::apply_event_fires_echo_once_per_rest_edge_and_wake_on_wake ... ok
2026-07-30T11:57:46.5071183Z test resting::tests::apply_event_wakes_a_cold_void_perch ... ok
2026-07-30T11:57:46.5073479Z test resting::tests::route_rest_event_contract_table ... ok
2026-07-30T11:57:46.5585743Z test resting::tests::apply_event_auto_suspends_under_the_resolved_chain ... ok
2026-07-30T11:57:46.5586747Z test resting::tests::suspend_with_broker_liveness_hint_edges_instead_of_no_edge ... ok
2026-07-30T11:57:46.5587823Z test resting::tests::transition_table_matches_the_context_model ... ok
2026-07-30T11:57:46.5589588Z test rollback_compat::tests::pre_ready_durable_files_are_additive_and_n1_readable ... ok
2026-07-30T11:57:46.5629524Z test resting::tests::deferred_held_keys_on_the_durable_rest_record ... ok
2026-07-30T11:57:46.5707089Z test resting::tests::rest_record_round_trips_with_anchor_discipline ... ok
2026-07-30T11:57:46.5983481Z test registryhost::tests::advertised_status_splits_unbound_warm_from_cold_suspended ... ok
2026-07-30T11:57:46.6596508Z test registryhost::tests::advertisement_carries_both_authored_blurb ... ok
2026-07-30T11:57:46.6597609Z test seedproofx::grace_tests::grade_truth_table ... ok
2026-07-30T11:57:46.6599306Z test seedproofx::grace_tests::seed_never_appears_in_roster_gossip ... ok
2026-07-30T11:57:46.6601195Z test seedproofx::grace_tests::seedxfer_frame_round_trips_and_rejects_malformed ... ok
2026-07-30T11:57:46.6602812Z test seedproofx::roster_tests::empty_roster_frame_round_trips ... ok
2026-07-30T11:57:46.6604255Z test seedproofx::roster_tests::malformed_roster_frame_rejected ... ok
2026-07-30T11:57:46.6606720Z test seedproofx::roster_tests::reconcile_fills_absent_keeps_observed_and_skips_self ... ok
2026-07-30T11:57:46.6608510Z test seedproofx::roster_tests::reconcile_refuses_mismatch_and_repairs_invalid_rows ... ok
2026-07-30T11:57:46.6610226Z test seedproofx::roster_tests::reconcile_replaces_a_suspect_row_with_the_validated_roster_address ... ok
2026-07-30T11:57:46.6612067Z test seedproofx::roster_tests::roster_frame_round_trips ... ok
2026-07-30T11:57:46.7236903Z test registryhost::tests::advertisement_carries_the_presence_datum ... ok
2026-07-30T11:57:46.7237696Z test service::tests::plan_start_prefers_service_then_spawn_idempotent ... ok
2026-07-30T11:57:46.7239135Z test service::tests::plan_stop_routes_managed_then_ipc_then_noop ... ok
2026-07-30T11:57:46.7240350Z test service::tests::run_refused_only_when_windows_and_vanishing ... ok
2026-07-30T11:57:46.7241916Z test service::tests::stale_bare_logon_action_classification ... ok
2026-07-30T11:57:46.7927619Z test registryhost::tests::advertisement_follows_resting_transitions_epoch_bumped ... ok
2026-07-30T11:57:46.8227467Z test registryhost::tests::erased_perch_is_advertised_offline_not_left_active ... ok
2026-07-30T11:57:46.8228894Z test servicehost::tests::a_healthy_run_resets_the_fast_exit_counter ... ok
2026-07-30T11:57:46.8501791Z test registryhost::tests::evict_silent_peers_never_touches_own_rows ... ok
2026-07-30T11:57:46.9144342Z test registryhost::tests::the_engine_room_is_absent_from_the_advertisement_until_it_chooses_a_viewer ... ok
2026-07-30T11:57:46.9146662Z test servicehost::tests::a_newer_daemons_status_row_degrades_instead_of_failing_the_whole_reply ... ok
2026-07-30T11:57:46.9471984Z test servicehost::tests::a_path_verified_orphan_is_reaped_and_confirmed_by_a_post_kill_read ... ok
2026-07-30T11:57:46.9758795Z test servicehost::tests::a_service_that_exits_instantly_latches_and_stops_relaunching ... ok
2026-07-30T11:57:47.0660693Z test relay::tests::relay_backlog_never_drains_active_only ... ok
2026-07-30T11:57:47.2251593Z test relay::tests::respawn_loses_no_spooled_message ... ok
2026-07-30T11:57:47.4187017Z test relay::tests::run_honors_stop ... ok
2026-07-30T11:57:47.5950673Z test resting::tests::daemon_rest_event_arms_gate_at_rest_edge_only ... ok
2026-07-30T11:57:47.7281706Z test resting::tests::rest_edges_cascade_shells_with_divergence ... ok
2026-07-30T11:57:47.7459955Z test servicehost::tests::a_startup_fault_carries_what_the_service_said_before_it_died ... ok
2026-07-30T11:57:52.2666753Z test servicehost::tests::a_silent_daemon_times_the_caller_out_instead_of_wedging_it ... ok
2026-07-30T11:57:52.4057534Z test servicehost::tests::a_stop_kills_the_child_and_re_reads_liveness_after_the_kill ... ok
2026-07-30T11:57:53.7684117Z test seedmap::tests::put_refreshes_existing ... ok
2026-07-30T11:57:53.7776120Z test seedmap::tests::put_then_take_consumes_once ... ok
2026-07-30T11:57:53.7787457Z test servicehost::tests::adapter_dir_substitutes_as_one_argv_element_even_with_spaces ... ok
2026-07-30T11:57:53.7842615Z test seedmap::tests::request_stop_barrier_holds_until_no_listener ... ok
2026-07-30T11:57:53.7908981Z test seedmap::tests::stop_op_acks_then_serve_returns ... ok
2026-07-30T11:57:53.7953482Z test servicehost::tests::an_exit_under_an_engaged_hold_stands_down_quiesced_instead_of_latching ... ok
2026-07-30T11:57:53.7974445Z test seedmap::tests::take_absent_is_none ... ok
2026-07-30T11:57:53.8115927Z test servicehost::tests::an_orphan_whose_image_cannot_be_verified_is_reported_not_killed ... ok
2026-07-30T11:57:53.8116956Z test servicehost::tests::backoff_doubles_and_saturates ... ok
2026-07-30T11:57:53.8118272Z test servicehost::tests::consecutive_fast_exits_latch_startup_fault_early ... ok
2026-07-30T11:57:53.8118794Z test servicehost::tests::an_orphan_pid_running_a_different_image_is_never_killed ... ok
2026-07-30T11:57:53.8129934Z test servicehost::tests::empty_and_dead_orphan_records_read_apart ... ok
2026-07-30T11:57:53.8131068Z test servicehost::tests::hold_outranks_everything ... ok
2026-07-30T11:57:53.8132519Z test servicehost::tests::only_the_three_ruled_opportunities_clear_the_latch ... ok
2026-07-30T11:57:53.8134080Z test servicehost::tests::quiesce_engages_the_hold_before_placing_the_stop_marker ... ok
2026-07-30T11:57:53.8156896Z test serveprobe::tests::is_serving_subnet_honors_membership_and_detach ... ok
2026-07-30T11:57:53.8158336Z test servicehost::tests::slow_crashes_latch_the_ordinary_give_up_not_startup_fault ... ok
2026-07-30T11:57:53.8159809Z test servicehost::tests::start_trigger_decides_which_opportunities_start_it ... ok
2026-07-30T11:57:53.8175987Z test servicehost::tests::a_bind_service_defers_at_boot_and_starts_at_its_bind ... ok
2026-07-30T11:57:53.8247064Z test servicehost::tests::ensure_supervised_is_one_instance_per_option_and_refuses_an_unclear_sweep ... ok
2026-07-30T11:57:53.9389642Z test servicehost::tests::a_boot_service_starts_once_and_the_next_sweep_reads_already_running ... ok
2026-07-30T11:57:54.2816096Z test servicehost::tests::a_held_option_is_refused_by_a_clearing_sweep_and_starts_only_when_the_hold_releases ... ok
2026-07-30T11:57:54.2826382Z test servicehost::tests::the_service_command_resolves_its_program_through_the_install_dir_helper ... ok
2026-07-30T11:57:54.2828126Z test servicehost::tests::the_service_spawn_scrubs_the_session_identity_env ... ok
2026-07-30T11:57:54.2834995Z test servicehost::tests::the_spawn_environment_carries_the_cli_capability ... ok
2026-07-30T11:57:54.2836641Z test servicehost::tests::the_spawn_environment_carries_the_per_option_identity ... ok
2026-07-30T11:57:54.3347633Z test servicehost::tests::a_latched_option_reports_the_captured_evidence_behind_its_latch ... ok
2026-07-30T11:57:54.4128179Z test servicehost::tests::a_service_that_exits_on_the_stop_marker_quiesces_cooperatively ... ok
2026-07-30T11:57:54.6498727Z test servicehost::tests::a_service_that_ignores_the_stop_marker_is_force_killed_and_confirmed_dead ... ok
2026-07-30T11:57:54.6500241Z test shellchan::tests::activity_frame_parses_back_through_the_public_decoder ... ok
2026-07-30T11:57:54.6501937Z test shellchan::tests::activity_frame_shape_is_the_published_one ... ok
2026-07-30T11:57:54.6503459Z test shellchan::tests::drive_frame_shape_mirrors_sensory ... ok
2026-07-30T11:57:54.6509279Z test shellchan::tests::frames_compose_and_stamp_roundtrips ... ok
2026-07-30T11:57:54.6510625Z test servicehost::tests::a_soft_deregistered_adapters_service_never_starts_in_the_first_place ... ok
2026-07-30T11:57:54.6512154Z test shellchan::tests::sensory_text_file_frames_shape ... ok
2026-07-30T11:57:54.6516238Z test shellchan::tests::vocab_check_bounds_ops_and_args ... ok
2026-07-30T11:57:54.6526874Z test servicehost::tests::a_status_read_mints_no_hold_flag_for_the_option_it_reports ... ok
2026-07-30T11:57:56.0406453Z test servicehost::tests::the_startup_capture_is_reclaimed_once_the_run_proves_it_starts ... ok
2026-07-30T11:57:56.0415689Z test shelldisc::tests::discover_across_joins_other_node_subnet_adapters ... ok
2026-07-30T11:57:56.0731864Z test shelldisc::tests::discovery_lists_a_dead_pid_instance_offline ... ok
2026-07-30T11:57:56.0735101Z test shellhost::tests::a_daemon_that_launches_is_the_only_launcher ... ok
2026-07-30T11:57:56.0740463Z test shellhost::tests::a_late_ack_loser_adopts_the_winner_instead_of_spawning ... ok
2026-07-30T11:57:56.0743863Z test shellhost::tests::a_post_ack_failure_never_spawns_again ... ok
2026-07-30T11:57:56.0746726Z test shellhost::tests::a_post_ack_silence_is_indeterminate_not_failure ... ok
2026-07-30T11:57:56.0751281Z test shellhost::tests::a_pre_ack_refusal_falls_back_in_process ... ok
2026-07-30T11:57:56.0771271Z test shelldisc::tests::shell_context_renders_sections_and_empties_to_none ... ok
2026-07-30T11:57:56.0819274Z test shellhost::tests::a_spawn_template_resolves_its_program_and_adapter_dir_against_the_install_dir ... ok
2026-07-30T11:57:56.0823607Z test shellhost::tests::an_answered_refusal_never_consults_the_arbiter ... ok
2026-07-30T11:57:56.0833076Z test shellhost::tests::an_unserved_socket_is_a_pre_ack_refusal ... ok
2026-07-30T11:57:56.4949194Z test servicehost::tests::a_stood_down_supervisors_latch_outlives_its_thread_and_suppresses_the_next_sweep ... ok
2026-07-30T11:57:56.5123231Z test shelldisc::tests::discovery_own_plus_broadcast_gated_instantiable ... ok
2026-07-30T11:57:56.6155612Z test shellhost::tests::a_spawn_program_the_install_dir_does_not_ship_falls_through_to_path ... ok
2026-07-30T11:57:56.6228497Z test servicehost::tests::a_supervised_option_no_longer_declared_still_appears_as_undeclared ... ok
2026-07-30T11:57:56.6936246Z test shellhost::tests::gateway_typed_owner_spawns_and_owns_a_shell ... ok
2026-07-30T11:57:56.7160217Z test shellchan::tests::restamp_carries_pending_rows_across_rotation ... ok
2026-07-30T11:57:56.7162963Z test shellhost::tests::link_key_and_frame_mac_roundtrip ... ok
2026-07-30T11:57:56.7247420Z test shellhost::tests::only_a_live_recorded_pid_wins_a_launch_race ... ok
2026-07-30T11:57:56.7252259Z test shellhost::tests::only_the_relay_receipt_routes_through_the_daemon ... ok
2026-07-30T11:57:56.7294087Z test shellhost::tests::spawn_template_perch_dir_fills_as_one_argv_element ... ok
2026-07-30T11:57:56.7344449Z test shellhost::tests::launch_parks_token_and_bind_by_token_onlines ... ok
2026-07-30T11:57:56.7347318Z test shellhost::tests::the_arbiter_does_not_block_an_uncontested_fallback ... ok
2026-07-30T11:57:56.7361873Z test shellwake::tests::a_wake_template_resolves_its_program_and_adapter_dir_against_the_install_dir ... ok
2026-07-30T11:57:56.7363254Z test shellwake::tests::backoff_curve_doubles_to_the_cap ... ok
2026-07-30T11:57:56.7385472Z test shellhost::tests::spawn_template_without_perch_dir_is_unchanged ... ok
2026-07-30T11:57:56.7484129Z test shellhost::tests::launch_fails_closed_on_bad_templates ... ok
2026-07-30T11:57:56.7736526Z test shellwake::tests::reconcile_never_adopts_a_stale_online_instance ... ok
2026-07-30T11:57:56.7901185Z test shellwake::tests::reconcile_resolves_profile_overlay ... ok
2026-07-30T11:57:56.7940074Z test shellwake::tests::resolve_wake_refuses_without_a_reachable_owner ... ok
2026-07-30T11:57:56.8422184Z test shellhost::tests::close_shell_ephemeral_tears_down_and_frees_the_slot ... ok
2026-07-30T11:57:56.8428535Z test shellwake::tests::the_wake_catalog_shares_the_spawn_vocabulary_but_is_not_the_same_set ... ok
2026-07-30T11:57:56.8452566Z test shellhost::tests::close_shell_dead_child_is_prompt_and_manifestless_never_erases ... ok
2026-07-30T11:57:56.9248660Z test shellhost::tests::close_shell_delivers_pre_close_then_kills_and_flips_offline ... ok
2026-07-30T11:57:56.9317194Z test shellwake::tests::resolve_wake_leaves_a_dormant_owner_and_relaunches ... ok
2026-07-30T11:57:56.9407209Z test stderrlog::tests::roll_keeps_bounded_generations_and_preserves_current ... ok
2026-07-30T11:57:56.9418895Z test stderrlog::tests::roll_with_keep_one_clears_without_backup ... ok
2026-07-30T11:57:56.9420560Z test stderrlog::tests::should_roll_at_or_over_cap_only ... ok
2026-07-30T11:57:56.9423000Z test sync::tests::gate_decision_table ... ok
2026-07-30T11:57:56.9727631Z test shellwake::tests::watcher_opcode_exit_fires_resolution_once ... ok
2026-07-30T11:57:57.0350755Z test servicehost::tests::a_supervisor_whose_declaration_is_gone_is_torn_down_by_the_next_sweep ... ok
2026-07-30T11:57:57.0675950Z test shellwake::tests::reconcile_flips_watchers_with_instance_state ... ok
2026-07-30T11:57:57.0677279Z test translation::tests::inject_floor_buffers_while_held_then_drains_in_order ... ok
2026-07-30T11:57:57.0679195Z test translation::tests::key_cmd_parses_each_wire_shape ... ok
2026-07-30T11:57:57.0680699Z test translation::tests::key_to_bytes_send_keys_map ... ok
2026-07-30T11:57:57.0682524Z test translation::tests::to_binary_serializes_to_wire_and_input_is_content_free ... ok
2026-07-30T11:57:57.0687372Z test transport::tests::local_socket_handshake_and_frame_round_trip ... ok
2026-07-30T11:57:57.0690590Z test transport::tests::local_socket_rejects_wrong_role ... ok
2026-07-30T11:57:57.0691997Z test tunnelhub::tests::clear_evicts_the_entry ... ok
2026-07-30T11:57:57.0693441Z test tunnelhub::tests::dead_generation_stream_is_never_surfaced ... ok
2026-07-30T11:57:57.0694829Z test tunnelhub::tests::entries_are_per_owner ... ok
2026-07-30T11:57:57.0696149Z test tunnelhub::tests::relink_overwrites_the_entry_with_a_fresh_generation ... ok
2026-07-30T11:57:57.0697339Z test tunnelhub::tests::resolve_serves_each_end_under_the_opening_token ... ok
2026-07-30T11:57:57.0698772Z test update::tests::apply_refuses_non_brain_only_plan ... ok
2026-07-30T11:57:57.0700008Z test update::tests::classify_brain_only_when_broker_hosts_new_brain ... ok
2026-07-30T11:57:57.0701300Z test update::tests::classify_broker_breaking_on_resource_abi_change ... ok
2026-07-30T11:57:57.0702469Z test update::tests::classify_broker_compatible_when_brain_below_floor ... ok
2026-07-30T11:57:57.0873547Z test update::tests::plan_verified_produces_no_plan_for_a_rejected_release ... ok
2026-07-30T11:57:57.1127698Z test update::tests::plan_verified_update_set_uses_selected_platform_spec ... ok
2026-07-30T11:57:57.1212669Z test update::tests::plan_verified_yields_a_plan_for_a_valid_release ... ok
2026-07-30T11:57:57.2046795Z test translation::tests::flagged_spawn_still_starts ... ok
2026-07-30T11:57:57.2049407Z test wan::tests::origin_user_backed_matrix ... ok
2026-07-30T11:57:57.2676349Z test servicehost::tests::an_adapter_scoped_sweep_neither_starts_nor_stops_another_adapters_service ... ok
2026-07-30T11:57:57.2677414Z test wan::tests::wan_ingress_empty_from_renders_origin_node_label ... ok
2026-07-30T11:57:57.2679586Z test wan::tests::wan_outcome_token_round_trips_and_unknown_is_noreply ... ok
2026-07-30T11:57:57.2681636Z test wan::tests::wan_user_msg_restamped_unless_origin_user_backed ... ok
2026-07-30T11:57:57.2688551Z test servicehost::tests::an_unknown_op_closes_the_connection_instead_of_wedging_the_caller ... ok
2026-07-30T11:57:57.2689910Z test xfer::tests::resolve_under_confines_to_root ... ok
2026-07-30T11:57:57.2695450Z test servicehost::tests::quiesce_raises_the_hold_before_it_can_place_any_stop_marker ... ok
2026-07-30T11:57:57.2857297Z test servicehost::tests::the_advisory_line_is_read_bounded_and_never_dressed_up_when_absent ... ok
2026-07-30T11:57:57.2893947Z test xfer::tests::recv_state_chunks_idempotent_and_commit_replays_safely ... ok
2026-07-30T11:57:57.5597741Z test shellwake::tests::watcher_crash_exits_respawn_then_give_up ... ok
2026-07-30T11:57:57.6095063Z test servicehost::tests::the_hold_outlives_the_force_killed_supervision_it_ended ... ok
2026-07-30T11:57:57.7487636Z test servicehost::tests::the_projection_reports_a_live_supervisor_with_its_declaration_and_advisory ... ok
2026-07-30T11:57:57.7497083Z test servicehost::tests::the_projection_scopes_to_one_adapter_and_keeps_deregistered_declarations ... ok
2026-07-30T11:57:57.7602575Z test servicehost::tests::the_status_op_reports_over_the_wire_and_starts_nothing ... ok
2026-07-30T11:57:58.1974029Z test servicehost::tests::the_stop_marker_is_never_visible_before_the_hold_is_up ... ok
2026-07-30T11:57:58.5134960Z test sync::tests::reconcile_driver_structurally_excludes_live_role ... ok
2026-07-30T11:57:58.5356940Z test shellwake::tests::resolve_wake_revives_a_suspended_owner_without_double_launch ... ok
2026-07-30T11:57:58.5363798Z test stderrlog::tests::path_under_home_and_stamp_is_legible ... ok
2026-07-30T11:57:58.6934763Z test wan::tests::no_binary_wan_arrival_spools_not_pty ... ok
2026-07-30T11:57:58.7018149Z test wan::tests::the_stamp_not_the_from_is_the_sender_subject ... ok
2026-07-30T11:57:59.1083535Z test sync::tests::select_refs_scopes_two_tiers ... ok
2026-07-30T11:57:59.1083809Z 
2026-07-30T11:57:59.1083957Z failures:
2026-07-30T11:57:59.1084049Z 
2026-07-30T11:57:59.1084223Z ---- daemon::tests::a_captured_spawn_inherits_only_the_handle_in_its_allowlist stdout ----
2026-07-30T11:57:59.1085209Z DETACH_BREAKAWAY_DENIED: the Job Object of the LAUNCHING process (spt_daemon-85fe692ab1a69039.exe pid=34032) forbids breakaway; spawned IN-JOB — the child belongs to THAT job and dies with it
2026-07-30T11:57:59.1085850Z 
2026-07-30T11:57:59.1086273Z thread 'daemon::tests::a_captured_spawn_inherits_only_the_handle_in_its_allowlist' (42692) panicked at crates\spt-daemon\src\daemon.rs:2166:9:
2026-07-30T11:57:59.1087117Z the child inherited a handle that was NOT in the allowlist — the allowlist is not doing the job that makes bInheritHandles = TRUE safe here
2026-07-30T11:57:59.1088125Z 
2026-07-30T11:57:59.1088129Z 
2026-07-30T11:57:59.1088197Z failures:
2026-07-30T11:57:59.1088472Z     daemon::tests::a_captured_spawn_inherits_only_the_handle_in_its_allowlist
2026-07-30T11:57:59.1088716Z 
2026-07-30T11:57:59.1088942Z test result: FAILED. 721 passed; 1 failed; 0 ignored; 0 measured; 0 filtered out; finished in 50.08s
2026-07-30T11:57:59.1089265Z 
2026-07-30T11:57:59.1153268Z error: test failed, to rerun pass `-p spt-daemon --lib`
2026-07-30T11:57:59.1758576Z ##[error]Process completed with exit code 1.
2026-07-30T11:57:59.1972894Z Post job cleanup.
2026-07-30T11:57:59.3117974Z [command]"C:\Program Files\Git\cmd\git.exe" version
2026-07-30T11:57:59.3358712Z git version 2.43.0.windows.1
2026-07-30T11:57:59.3395287Z Copying 'C:\Users\decid\.gitconfig' to 'C:\actions-runner\_work\_temp\98ebbd53-846e-4bc3-a1c6-23c7baa3076d\.gitconfig'
2026-07-30T11:57:59.3408945Z Temporarily overriding HOME='C:\actions-runner\_work\_temp\98ebbd53-846e-4bc3-a1c6-23c7baa3076d' before making global git config changes
2026-07-30T11:57:59.3409772Z Adding repository directory to the temporary git global config as a safe directory
2026-07-30T11:57:59.3414007Z [command]"C:\Program Files\Git\cmd\git.exe" config --global --add safe.directory C:\actions-runner\_work\spt-bs-core\spt-bs-core
2026-07-30T11:57:59.5019430Z [command]"C:\Program Files\Git\cmd\git.exe" config --local --name-only --get-regexp core\.sshCommand
2026-07-30T11:57:59.5272140Z [command]"C:\Program Files\Git\cmd\git.exe" submodule foreach --recursive "sh -c \"git config --local --name-only --get-regexp 'core\.sshCommand' && git config --local --unset-all 'core.sshCommand' || :\""
2026-07-30T11:58:00.2160257Z [command]"C:\Program Files\Git\cmd\git.exe" config --local --name-only --get-regexp http\.https\:\/\/github\.com\/\.extraheader
2026-07-30T11:58:00.2395680Z http.https://github.com/.extraheader
2026-07-30T11:58:00.2424510Z [command]"C:\Program Files\Git\cmd\git.exe" config --local --unset-all http.https://github.com/.extraheader
2026-07-30T11:58:00.2715068Z [command]"C:\Program Files\Git\cmd\git.exe" submodule foreach --recursive "sh -c \"git config --local --name-only --get-regexp 'http\.https\:\/\/github\.com\/\.extraheader' && git config --local --unset-all 'http.https://github.com/.extraheader' || :\""
2026-07-30T11:58:01.2696617Z [command]"C:\Program Files\Git\cmd\git.exe" config --local --name-only --get-regexp ^includeIf\.gitdir:
2026-07-30T11:58:01.4221953Z [command]"C:\Program Files\Git\cmd\git.exe" submodule foreach --recursive "git config --local --show-origin --name-only --get-regexp remote.origin.url"
2026-07-30T11:58:02.8914282Z Cleaning up orphan processes
2026-07-30T11:58:02.9754800Z Terminate orphan process: pid (22324) (vctip)
2026-07-30T11:58:03.0319448Z Terminate orphan process: pid (4484) (PING)
2026-07-30T11:58:03.0347189Z Terminate orphan process: pid (44656) (PING)
